Phenol, 2-butyl-
- Formula: C10H14O
- Molecular weight: 150.2176
- IUPAC Standard InChIKey: GJYCVCVHRSWLNY-UHFFFAOYSA-N
- CAS Registry Number: 3180-09-4
- Chemical structure:
View 3d structure (requires JavaScript / HTML 5) - Other names: Phenol, o-butyl-; o-Butylphenol; 2-Butylphenol; 1-Hydroxy-2-n-butylbenzene; 2-n-Butylphenol; UN 2228; UN 2229

Phase change data

Data compiled as indicated in comments:
TRC - Thermodynamics Research Center, NIST Boulder Laboratories, Chris Muzny director
AC - William E. Acree, Jr., James S. Chickos
Quantity | Value | Units | Method | Reference | Comment |
---|---|---|---|---|---|
Tboil | 505. ± 9. | K | AVG | N/A | Average of 9 values; Individual data points |
Quantity | Value | Units | Method | Reference | Comment |
Tfus | 253.15 | K | N/A | Karr, 1957 | Uncertainty assigned by TRC = 2. K; TRC |
Enthalpy of vaporization
ΔvapH (kJ/mol) | Temperature (K) | Method | Reference | Comment |
---|---|---|---|---|
55.1 | 418. | A | Stephenson and Malanowski, 1987 | Based on data from 403. to 533. K. See also Arro, Melder, et al., 1975.; AC |
52.9 | 398. | N/A | Stage, Müller, et al., 1953 | Based on data from 382. to 520. K.; AC |
51.0 | 423. | N/A | Stage, Müller, et al., 1953 | Based on data from 382. to 520. K.; AC |
47.0 | 473. | N/A | Stage, Müller, et al., 1953 | Based on data from 382. to 520. K.; AC |

References

Karr, 1957
Karr, C.,
, U. S. Bur. Mines, Inform. Circ. IC 7802, 1957. [all data]
Stephenson and Malanowski, 1987
Stephenson, Richard M.; Malanowski, Stanislaw,
Handbook of the Thermodynamics of Organic Compounds, 1987, https://doi.org/10.1007/978-94-009-3173-2
. [all data]
Arro, Melder, et al., 1975
Arro, J.; Melder, L.; Tamvelius, H.,
Trudy Tallinskogo Politekhnicheskogo Instit., 1975, 390, 37. [all data]
Stage, Müller, et al., 1953
Stage, H.; Müller, E.; Faldix, P.,
Erdol u Kohle, 1953, 6, 375. [all data]