Cyclohexane, (1,1-dimethylpropyl)-
- Formula: C11H22
- Molecular weight: 154.2924
- IUPAC Standard InChIKey: HEOYZKPYPRYIAR-UHFFFAOYSA-N
- CAS Registry Number: 31797-64-5
- Chemical structure:
View 3d structure (requires JavaScript / HTML 5) - Other names: Cyclohexane, tert-pentyl-; tert-Pentylcyclohexane; 2-Cyclohexyl-2-methylbutane; 2-Methyl-2-cyclohexylbutane; t-Pentylcyclohexane

Kovats' RI, non-polar column, temperature ramp

Column type | Active phase | I | Reference | Comment |
---|---|---|---|---|
Capillary | Apiezon L | 1130. | Louis, 1971 | N2, 1. K/min; Column length: 50. m; Column diameter: 0.25 mm; Tstart: 60. C |

Van Den Dool and Kratz RI, non-polar column, temperature ramp

Column type | Active phase | I | Reference | Comment |
---|---|---|---|---|
Capillary | Petrocol DH | 1100. | White, Hackett, et al., 1992 | 100. m/0.25 mm/0.5 μm, He, 1. K/min; Tstart: 30. C; Tend: 220. C |

Normal alkane RI, non-polar column, temperature ramp

Column type | Active phase | I | Reference | Comment |
---|---|---|---|---|
Capillary | Petrocol DH | 1100. | Supelco, 2012 | 100. m/0.25 mm/0.50 μm, Helium, 20. C @ 15. min, 15. K/min, 220. C @ 30. min |

Phase change data

Data compiled by: Thermodynamics Research Center, NIST Boulder Laboratories, Chris Muzny director
Quantity | Value | Units | Method | Reference | Comment |
---|---|---|---|---|---|
Tboil | 471.55 | K | N/A | Anonymous, 1951 | Uncertainty assigned by TRC = 0.4 K |
Tboil | 471.23 | K | N/A | Anonymous, 1950 | Uncertainty assigned by TRC = 0.5 K |
Tboil | 471.23 | K | N/A | Boord, Greenlee, et al., 1950 | Uncertainty assigned by TRC = 0.5 K |
Tboil | 465. | K | N/A | Halse, 1915 | Uncertainty assigned by TRC = 5. K |

References

Louis, 1971
Louis, R.,
Kovats-index-tafeln zur gaschromatographischen analyse von kohlenwasserstoffgemischen,
Erdoel Kohle Erdgas Petrochem., 1971, 24, 2, 88-94. [all data]
White, Hackett, et al., 1992
White, C.M.; Hackett, J.; Anderson, R.R.; Kail, S.; Spock, P.S.,
Linear temperature programmed retention indices of gasoline range hydrocarbons and chlorinated hydrocarbons on cross-linked polydimethylsiloxane,
J. Hi. Res. Chromatogr., 1992, 15, 2, 105-120, https://doi.org/10.1002/jhrc.1240150211
. [all data]
Supelco, 2012
Supelco, CatalogNo. 24160-U,
Petrocol DH Columns. Catalog No. 24160-U, 2012, retrieved from http://www.sigmaaldrich.com/etc/medialib/docs/Supelco/Datasheet/1/w97949.Par.0001.File.tmp/w97949.pdf. [all data]