Cyclohexane, 1,1'-(1,3-propanediyl)bis-
- Formula: C15H28
- Molecular weight: 208.3828
- IUPAC Standard InChIKey: LIQIPWNPFZCAIQ-UHFFFAOYSA-N
- CAS Registry Number: 3178-24-3
- Chemical structure:
View 3d structure (requires JavaScript / HTML 5) - Other names: Propane, 1,3-dicyclohexyl-; 1,3-Dicyclohexylpropane

Phase change data

Data compiled by: Thermodynamics Research Center, NIST Boulder Laboratories, Chris Muzny director
Quantity | Value | Units | Method | Reference | Comment |
---|---|---|---|---|---|
Tboil | 564.84 | K | N/A | Serijan and Wise, 1951 | Uncertainty assigned by TRC = 0.3 K |
Tboil | 563. | K | N/A | Sabatier and Murat, 1915 | Uncertainty assigned by TRC = 5. K |
Tboil | 565. | K | N/A | Frezouls, 1912 | Uncertainty assigned by TRC = 5. K |
Tboil | 563. | K | N/A | Sabatier and Murat, 1912 | Uncertainty assigned by TRC = 5. K |
Quantity | Value | Units | Method | Reference | Comment |
Tfus | 258.33 | K | N/A | Serijan and Wise, 1951, 2 | Uncertainty assigned by TRC = 1. K |
Tfus | 258.33 | K | N/A | Serijan and Wise, 1951 | Uncertainty assigned by TRC = 0.2 K |
Tfus | 243. | K | N/A | Frezouls, 1912 | Uncertainty assigned by TRC = 6. K |

Condensed phase thermochemistry data

Data compiled by: Hussein Y. Afeefy, Joel F. Liebman, and Stephen E. Stein
Quantity | Value | Units | Method | Reference | Comment |
---|---|---|---|---|---|
ΔcH°liquid | -9017. | kJ/mol | Ccb | Serijan and Wise, 1951 | Corresponding ΔfHºliquid = -887. kJ/mol (simple calculation by NIST; no Washburn corrections) |
ΔcH°liquid | -9637.0 | kJ/mol | Ccb | Wise, Serijan, et al., 1951 | Corresponding ΔfHºliquid = -267. kJ/mol (simple calculation by NIST; no Washburn corrections) |

References

Serijan and Wise, 1951
Serijan, K.T.; Wise, P.H.,
Dicylic Hydrocarbons. III. Diphenyl- and Dicyclohexylalkanes through C15,
J. Am. Chem. Soc., 1951, 73, 4766. [all data]
Sabatier and Murat, 1915
Sabatier, P.; Murat, M.,
Ann. Chim. (Paris), 1915, 4, 253. [all data]
Frezouls, 1912
Frezouls, J.,
C. R. Hebd. Seances Acad. Sci., 1912, 155, 42. [all data]
Sabatier and Murat, 1912
Sabatier, P.; Murat, M.,
C. R. Hebd. Seances Acad. Sci., 1912, 155, 385. [all data]
Serijan and Wise, 1951, 2
Serijan, K.T.; Wise, P.H.,
, Natl. Advis. Comm. Aeronaut., Lewis Flight Propulsion Lab ., Cleveland, 1951. [all data]