Cyclohexane, 1,1'-methylenebis-
- Formula: C13H24
- Molecular weight: 180.3297
- IUPAC Standard InChIKey: XXKOQQBKBHUATC-UHFFFAOYSA-N
- CAS Registry Number: 3178-23-2
- Chemical structure:
View 3d structure (requires JavaScript / HTML 5) - Other names: Methane, dicyclohexyl-; Dicyclohexylmethane

Condensed phase thermochemistry data

Data compiled as indicated in comments:
ALS - Hussein Y. Afeefy, Joel F. Liebman, and Stephen E. Stein
DH - Eugene S. Domalski and Elizabeth D. Hearing
Quantity | Value | Units | Method | Reference | Comment |
---|---|---|---|---|---|
ΔcH°liquid | -8170.45 | kJ/mol | Ccb | Gollis, Belenyessy, et al., 1962 | Corresponding ΔfHºliquid = -375.14 kJ/mol (simple calculation by NIST; no Washburn corrections); ALS |
ΔcH°liquid | -7719. | kJ/mol | Ccb | Serijan and Wise, 1951 | Corresponding ΔfHºliquid = -824. kJ/mol (simple calculation by NIST; no Washburn corrections); ALS |
ΔcH°liquid | -8250.8 | kJ/mol | Ccb | Wise, Serijan, et al., 1951 | Corresponding ΔfHºliquid = -295. kJ/mol (simple calculation by NIST; no Washburn corrections); ALS |
Constant pressure heat capacity of liquid
Cp,liquid (J/mol*K) | Temperature (K) | Reference | Comment |
---|---|---|---|
320.1 | 313. | Gudinowicz, Campbell, et al., 1963 | T = 313 to 483 K.; DH |
355.2 | 311. | Gollis, Belenyessy, et al., 1962, 2 | Temperatures 100, 200, 300°F.; DH |

Kovats' RI, non-polar column, isothermal

Data compiled by: NIST Mass Spectrometry Data Center, William E. Wallace, director

Column type PackedPackedPacked
Active phase SE-30SE-30Apiezon L
Column length (m)
Carrier gas
Substrate
Column diameter (mm)
Phase thickness (μm)
Temperature (C) 150.200.150.
I 1385.1418.1427.
ReferenceShlyakhov, Anvaer, et al., 1975Shlyakhov, Anvaer, et al., 1975Shlyakhov, Anvaer, et al., 1975
Comment MSDC-RI MSDC-RI MSDC-RI

References

Gollis, Belenyessy, et al., 1962
Gollis, M.H.; Belenyessy, L.I.; Gudzinowicz, B.J.; Koch, S.D.; Smith, J.O.; Wineman, R.J.,
Evaluation of pure hydrocarbons as jet fuels,
J. Chem. Eng. Data, 1962, 7, 331-316. [all data]
Serijan and Wise, 1951
Serijan, K.T.; Wise, P.H.,
Dicyclic hydrocarbons. III. Diphenyl- and dicyclohexylalkanes through C15,
J. Am. Chem. Soc., 1951, 73, 4766-4769. [all data]
Wise, Serijan, et al., 1951
Wise, C.H.; Serijan, K.T.; Goodman, I.A.,
NACA Technical Report 1003,
NACA Technical Report 1003, 1951, 1-10. [all data]
Gudinowicz, Campbell, et al., 1963
Gudinowicz, B.J.; Campbell, R.H.; Adams, J.S.,
Specific heat measurements of complex saturated hydrocarbons,
J. Chem. Eng. Data, 1963, 8, 201-214. [all data]
Gollis, Belenyessy, et al., 1962, 2
Gollis, M.H.; Belenyessy, L.I.; Gudzinowicz, B.J.; Koch, S.D.; Smith, J.O.; Wineman, R.J.,
Evaluations of pure hydrocarbons as Jet Fuels,
J. Chem. Eng. Data, 1962, 7, 311-316. [all data]