Propane, 1,2,2-trichloro-
- Formula: C3H5Cl3
- Molecular weight: 147.431
- IUPAC Standard InChIKey: DAIIXVPKQATIMF-UHFFFAOYSA-N
- CAS Registry Number: 3175-23-3
- Chemical structure:
View 3d structure (requires JavaScript / HTML 5) - Other names: 1,2,2-Trichloropropane

Phase change data

Data compiled as indicated in comments:
BS - Robert L. Brown and Stephen E. Stein
TRC - Thermodynamics Research Center, NIST Boulder Laboratories, Chris Muzny director
Quantity | Value | Units | Method | Reference | Comment |
---|---|---|---|---|---|
Tboil | 397.2 | K | N/A | Weast and Grasselli, 1989 | BS |
Tboil | 396.15 | K | N/A | Galitzenstein and Woolf, 1950 | Uncertainty assigned by TRC = 2. K; TRC |
Tboil | 397.15 | K | N/A | Zellner, 1945 | Uncertainty assigned by TRC = 3. K; TRC |
Tboil | 395. | K | N/A | Ewell and Welch, 1941 | Uncertainty assigned by TRC = 1.5 K; TRC |
Tboil | 400. | K | N/A | Friedel and Silva, 1872 | Uncertainty assigned by TRC = 3. K; TRC |

Normal alkane RI, non-polar column, temperature ramp

View large format table.

Column type Active phase I Reference Comment
CapillaryOV-101781.Zenkevich, Eliseenkov, et al., 201125. m/0.20 mm/0.25 μm, Nitrogen, 6. K/min; Tstart: 40. C; Tend: 220. C

References

Weast and Grasselli, 1989
CRC Handbook of Data on Organic Compounds, 2nd Editon, Weast,R.C and Grasselli, J.G., ed(s)., CRC Press, Inc., Boca Raton, FL, 1989, 1. [all data]
Galitzenstein and Woolf, 1950
Galitzenstein; Woolf,
J. Soc. Chem. Ind., London, 1950, 69, 289. [all data]
Zellner, 1945
Zellner, C.N.,
, 1945. [all data]
Ewell and Welch, 1941
Ewell, R.H.; Welch, L.M.,
Maximum Boiling Mixtures of chloroparaffins with Donor Liquids,
J. Am. Chem. Soc., 1941, 63, 2475. [all data]
Friedel and Silva, 1872
Friedel, C.; Silva, R.D.,
C. R. Hebd. Seances Acad. Sci., 1872, 74, 805. [all data]