1-Methyl-6-chlorouracil
- Formula: C5H5ClN2O2
- Molecular weight: 160.558
- IUPAC Standard InChIKey: AOSGEKKSRYJBGW-UHFFFAOYSA-N
- CAS Registry Number: 31737-09-4
- Chemical structure:
View 3d structure (requires JavaScript / HTML 5) - Permanent link for this species. Use this link for bookmarking this species for future reference.

Phase change data

Data compiled by: William E. Acree, Jr., James S. Chickos
Enthalpy of sublimation
ΔsubH (kJ/mol) | Temperature (K) | Method | Reference |
---|---|---|---|
109. ± 8. | 417. to 465. | HSA | Nowak, Szczepaniak, et al., 1978 |

References

Nowak, Szczepaniak, et al., 1978
Nowak, M.J.; Szczepaniak, K.; Barski, A.; Shugar, D.Z.,
Z. Naturforsch. C, 1978, 33C, 876. [all data]