Cyclohexane, isocyanato-
- Formula: C7H11NO
- Molecular weight: 125.1683
- IUPAC Standard InChIKey: KQWGXHWJMSMDJJ-UHFFFAOYSA-N
- CAS Registry Number: 3173-53-3
- Chemical structure:
View 3d structure (requires JavaScript / HTML 5) - Other names: Isocyanic acid, cyclohexyl ester; Cyclohexyl isocyanate; Isocyanatocyclohexane; NSC 87419; UN 2488; Cyclohexyl ester of isocyanic acid

Reaction thermochemistry data

Data compiled by: Hussein Y. Afeefy, Joel F. Liebman, and Stephen E. Stein
Individual Reactions
By formula: C7H11NO + C6H7N = C13H18N2O
Quantity | Value | Units | Method | Reference | Comment |
---|---|---|---|---|---|
ΔrH° | -98.4 ± 1.1 | kJ/mol | Cm | Kiselev, Malkov, et al., 1989 | liquid phase; solvent: Dioxane |

References

Kiselev, Malkov, et al., 1989
Kiselev, V.D.; Malkov, V.B.; Murzin, D.G.; Shakirov, I.M.; Konovalov, A.I.,
Thermochemical study of the reaction of isocyanate with amines,
Dokl. Phys. Chem. (Engl. Transl.), 1989, 308, 711-713, In original 111. [all data]