Acetyl radical
- Formula: C2H3O
- Molecular weight: 43.0446
- IUPAC Standard InChIKey: TUCNEACPLKLKNU-UHFFFAOYSA-N
- CAS Registry Number: 3170-69-2
- Chemical structure:
View 3d structure (requires JavaScript / HTML 5) - Permanent link for this species. Use this link for bookmarking this species for future reference.

Gas phase thermochemistry data

Quantity | Value | Units | Method | Reference | Comment |
---|---|---|---|---|---|
ΔfH°gas | -12. ± 3. | kJ/mol | N/A | Tsang, 1996 |

Gas phase ion energetics data

Data evaluated as indicated in comments:
HL - Edward P. Hunter and Sharon G. Lias
Data compiled as indicated in comments:
LL - Sharon G. Lias and Joel F. Liebman
RDSH - Henry M. Rosenstock, Keith Draxl, Bruce W. Steiner, and John T. Herron
B - John E. Bartmess
Quantity | Value | Units | Method | Reference | Comment |
---|---|---|---|---|---|
Proton affinity (review) | 156. | kcal/mol | N/A | Hunter and Lias, 1998 | HL |
Quantity | Value | Units | Method | Reference | Comment |
Gas basicity | 148.3 | kcal/mol | N/A | Hunter and Lias, 1998 | HL |
Quantity | Value | Units | Method | Reference | Comment |
ΔfH°(+) ion | 158. | kcal/mol | N/A | N/A |
Electron affinity determinations
EA (eV) | Method | Reference | Comment |
---|---|---|---|
0.423 ± 0.037 | LPES | Nimlos, Soderquist, et al., 1989 | B |
0.516 ± 0.093 | D-EA | DePuy, Bierbaum, et al., 1985 | B |
Ionization energy determinations
IE (eV) | Method | Reference | Comment |
---|---|---|---|
7.0 | DER | Lias, Bartmess, et al., 1988 | LL |
8.05 ± 0.17 | EI | Reed and Brand, 1958 | RDSH |

References

Tsang, 1996
Tsang, W.,
Heats of Formation of Organic Free Radicals by Kinetic Methods
in Energetics of Organic Free Radicals, Martinho Simoes, J.A.; Greenberg, A.; Liebman, J.F., eds., Blackie Academic and Professional, London, 1996, 22-58. [all data]