2,7-nonadiyne

Phase change data

Data compiled by: Thermodynamics Research Center, NIST Boulder Laboratories, Chris Muzny director

Quantity Value Units Method Reference Comment
Tboil453.15KN/AHenne and Greenlee, 1945Uncertainty assigned by TRC = 0.3 K
Quantity Value Units Method Reference Comment
Tfus277.45KN/AHenne and Greenlee, 1945Uncertainty assigned by TRC = 0.2 K

In addition to the Thermodynamics Research Center (TRC) data available from this site, much more physical and chemical property data is available from the following TRC products:

References

Henne and Greenlee, 1945
Henne, A.L.; Greenlee, K.W., Preparation and Physical Constants of Acetylenic Compounds, J. Am. Chem. Soc., 1945, 67, 484-5. [all data]