Ethanone, 1-(2-methyl-1-cyclopenten-1-yl)-
- Formula: C8H12O
- Molecular weight: 124.1803
- IUPAC Standard InChIKey: HDURLXYBKGWETC-UHFFFAOYSA-N
- CAS Registry Number: 3168-90-9
- Chemical structure:
View 3d structure (requires JavaScript / HTML 5) - Other names: Ketone, methyl 2-methyl-1-cyclopenten-1-yl; 1-Acetyl-2-methylcyclopentene; 1-Acetyl-2-methyl-1-cyclopentene; 1-Acetyl-2-methyl-2-cyclopentene

Phase change data

Data compiled by: Robert L. Brown and Stephen E. Stein
Quantity | Value | Units | Method | Reference | Comment |
---|---|---|---|---|---|
Tboil | 462.7 | K | N/A | Aldrich Chemical Company Inc., 1990 |

Normal alkane RI, polar column, custom temperature program

Column type | Active phase | I | Reference | Comment |
---|---|---|---|---|
Capillary | Carbowax | 1504. | Baltes and Bochmann, 1987 | Program: not specified |
Capillary | Carbowax | 1504. | Baltes and Bochmann, 1987 | Program: not specified |

References

Aldrich Chemical Company Inc., 1990
Aldrich Chemical Company Inc.,
Catalog Handbook of Fine Chemicals, Aldrich Chemical Company, Inc., Milwaukee WI, 1990, 1. [all data]
Baltes and Bochmann, 1987
Baltes, W.; Bochmann, G.,
Model reactions on roast aroma formations, V. Mass spectrometric identification of pyrifines, oxazoles, and carbocyclic compounds from the reaction of serine and threonine with sucrose under the conditions of coffee roasting,
Z. Lebensm. Unters. Forsch., 1987, 185, 1, 5-9, https://doi.org/10.1007/BF01083331
. [all data]