1-(Nitromethyl)-cyclohexanol
- Formula: C7H13NO3
- Molecular weight: 159.1830
- IUPAC Standard InChIKey: WYXVEDWVPJRBJM-UHFFFAOYSA-N
- CAS Registry Number: 3164-73-6
- Chemical structure:
View 3d structure (requires JavaScript / HTML 5) - Other names: 1-Nitromethyl-1-cyclohexanol

Phase change data

Data compiled by: Robert L. Brown and Stephen E. Stein
Reduced pressure boiling point
Tboil (K) | Pressure (bar) | Reference |
---|---|---|
406. to 409. | 0.029 | Frinton Laboratories Inc., 1986 |

References

Frinton Laboratories Inc., 1986
Frinton Laboratories Inc.,
Catalog Number 11, Frinton Laboratories Inc., Vineland, NJ, 1986, 99. [all data]