3',4'-(Methylenedioxy)acetophenone
- Formula: C9H8O3
- Molecular weight: 164.1580
- IUPAC Standard InChIKey: BMHMKWXYXFBWMI-UHFFFAOYSA-N
- CAS Registry Number: 3162-29-6
- Chemical structure:
View 3d structure (requires JavaScript / HTML 5) - Other names: 3,4-Methylenedioxyacetophenone; Acetopiperone; Ethanone, 1-(1,3-benzodioxol-5-yl)-; 3,4-Methylen-dioxy-acetophenon; 3,4-Methylenedioxycetophenone; 1-(1,3-benzodioxol-5-yl)ethan-1-one

Phase change data

Data compiled as indicated in comments:
BS - Robert L. Brown and Stephen E. Stein
AC - William E. Acree, Jr., James S. Chickos
Quantity | Value | Units | Method | Reference | Comment |
---|---|---|---|---|---|
ΔsubH° | 104.4 ± 2.2 | kJ/mol | C | Matos, Sousa, et al., 2007 | AC |
Reduced pressure boiling point
Tboil (K) | Pressure (bar) | Reference | Comment |
---|---|---|---|
425. to 428. | 0.020 | Frinton Laboratories Inc., 1986 | BS |
Enthalpy of fusion
ΔfusH (kJ/mol) | Temperature (K) | Method | Reference | Comment |
---|---|---|---|---|
26.23 | 358.9 | DSC | Matos, Sousa, et al., 2007 | AC |

References

Matos, Sousa, et al., 2007
Matos, M. Agostinha R.; Sousa, Clara C.S.; Morais, Victor M.F.,
Experimental and Computational Thermochemistry of 1,3-Benzodioxole Derivatives,
J. Chem. Eng. Data, 2007, 52, 3, 1089-1094, https://doi.org/10.1021/je700035m
. [all data]
Frinton Laboratories Inc., 1986
Frinton Laboratories Inc.,
Catalog Number 11, Frinton Laboratories Inc., Vineland, NJ, 1986, 99. [all data]