p,β-Dinitrostyrene
- Formula: C8H6N2O4
- Molecular weight: 194.1442
- IUPAC Standard InChIKey: HABXLWPUIWFTNM-AATRIKPKSA-N
- CAS Registry Number: 3156-41-0
- Chemical structure:
View 3d structure (requires JavaScript / HTML 5) - Other names: Benzene, 1-nitro-4-(2-nitroethenyl)-; Styrene, p,β-dinitro-; 1-Nitro-2-(p-nitrophenyl)ethylene; 2-Nitro-1-(4-nitrophenyl)ethene; 4-Nitro-β-nitrostyrene; Ethene,-1-(4-nitrophenyl)-2-nitro-; 1-Nitro-4-(2-nitroethenyl)benzene

Condensed phase thermochemistry data

Data compiled by: Hussein Y. Afeefy, Joel F. Liebman, and Stephen E. Stein
Quantity | Value | Units | Method | Reference | Comment |
---|---|---|---|---|---|
ΔcH°solid | -4027.57 | kJ/mol | Ccb | Verkade, 1926 |

References

Verkade, 1926
Verkade, P.E.,
Verbrandingswarmten van plaatsings-isomere benzol-derivaten en de theorie der geinduceerde alterneeren de polatiteit,
Verslag Akad. Wetenschappen Amsterdam, 1926, 35, 492-504. [all data]