Butanoic acid, 4-chloro-, ethyl ester
- Formula: C6H11ClO2
- Molecular weight: 150.603
- IUPAC Standard InChIKey: OPXNFHAILOHHFO-UHFFFAOYSA-N
- CAS Registry Number: 3153-36-4
- Chemical structure:
View 3d structure (requires JavaScript / HTML 5) - Other names: Butyric acid, 4-chloro-, ethyl ester; Ethyl γ-chlorobutyrate; Ethyl 4-chlorobutanoate; Ethyl 4-chlorobutyrate; 4-Chlorobutanoic acid ethyl ester; Cl(CH2)3C(O)OC2H5; γ-Chlorobutyric acid ethyl ester; Ethyl ω-chlorobutyrate; 4-Chlorobutyric acid ethyl ester; NSC 81215

Gas phase thermochemistry data

Data compiled by: Hussein Y. Afeefy, Joel F. Liebman, and Stephen E. Stein
Quantity | Value | Units | Method | Reference | Comment |
---|---|---|---|---|---|
ΔfH°gas | -513.8 ± 9.6 | kJ/mol | Ccb | Smith, Bjellerup, et al., 1953 | Heat of formation derived by Cox and Pilcher, 1970 |

Condensed phase thermochemistry data

Data compiled by: Hussein Y. Afeefy, Joel F. Liebman, and Stephen E. Stein
Quantity | Value | Units | Method | Reference | Comment |
---|---|---|---|---|---|
ΔfH°liquid | -566.5 ± 8.4 | kJ/mol | Ccb | Smith, Bjellerup, et al., 1953 | Heat of formation derived by Cox and Pilcher, 1970 |
Quantity | Value | Units | Method | Reference | Comment |
ΔcH°liquid | -3390.3 ± 8.4 | kJ/mol | Ccb | Smith, Bjellerup, et al., 1953 | Reanalyzed by Cox and Pilcher, 1970, Original value = -3401.0 ± 4.2 kJ/mol; Heat of formation derived by Cox and Pilcher, 1970 |
ΔcH°liquid | -3383. | kJ/mol | Ccb | Schjanberg, 1935 |

Phase change data

Data compiled as indicated in comments:
BS - Robert L. Brown and Stephen E. Stein
ALS - Hussein Y. Afeefy, Joel F. Liebman, and Stephen E. Stein
Quantity | Value | Units | Method | Reference | Comment |
---|---|---|---|---|---|
Tboil | 459.2 | K | N/A | Weast and Grasselli, 1989 | BS |
Quantity | Value | Units | Method | Reference | Comment |
ΔvapH° | 52.7 ± 4.2 | kJ/mol | V | Smith, Bjellerup, et al., 1953 | Heat of formation derived by Cox and Pilcher, 1970; ALS |

Kovats' RI, non-polar column, isothermal

Column type | Active phase | Temperature (C) | I | Reference | Comment |
---|---|---|---|---|---|
Capillary | SE-30 | 100. | 1022. | Haken and Korhonen, 1985 | N2; Column length: 25. m; Column diameter: 0.33 mm |
Capillary | SE-30 | 120. | 1018. | Haken and Korhonen, 1985 | N2; Column length: 25. m; Column diameter: 0.33 mm |
Capillary | SE-30 | 140. | 1002. | Haken and Korhonen, 1985 | N2; Column length: 25. m; Column diameter: 0.33 mm |
Capillary | SE-30 | 80. | 1015. | Haken and Korhonen, 1985 | N2; Column length: 25. m; Column diameter: 0.33 mm |

References

Smith, Bjellerup, et al., 1953
Smith, L.; Bjellerup, L.; Krook, S.; Westermark, H.,
Heats of combustion of organic chloro compounds determined by the "quartz wool" method,
Acta Chem. Scand., 1953, 7, 65. [all data]
Cox and Pilcher, 1970
Cox, J.D.; Pilcher, G.,
Thermochemistry of Organic and Organometallic Compounds, Academic Press, New York, 1970, 1-636. [all data]
Schjanberg, 1935
Schjanberg, E.,
Die Verbrennungswarmen und die Refraktionsdaten einiger chlorsubstituierter Fettsauren und Ester.,
Z. Phys. Chem. Abt. A, 1935, 172, 197-233. [all data]
Weast and Grasselli, 1989
CRC Handbook of Data on Organic Compounds, 2nd Editon, Weast,R.C and Grasselli, J.G., ed(s)., CRC Press, Inc., Boca Raton, FL, 1989, 1. [all data]
Haken and Korhonen, 1985
Haken, J.K.; Korhonen, I.O.O.,
Gas chromatography of homologous esters. XXVIII. Retention increments of aliphatic C1-C18 n-alkyl esters of butanoic acid and its monochloro derivatives on SE-30 and OV-351 capillary columns,
J. Chromatogr., 1985, 320, 2, 325-334, https://doi.org/10.1016/S0021-9673(01)90510-2
. [all data]