Isopropyl 4-chlorobutyrate
- Formula: C7H13ClO2
- Molecular weight: 164.630
- IUPAC Standard InChIKey: JNUHPPXYHXKRFA-UHFFFAOYSA-N
- CAS Registry Number: 3153-34-2
- Chemical structure:
View 3d structure (requires JavaScript / HTML 5) - Species with the same structure:

Condensed phase thermochemistry data

Data compiled by: Hussein Y. Afeefy, Joel F. Liebman, and Stephen E. Stein
Quantity | Value | Units | Method | Reference | Comment |
---|---|---|---|---|---|
ΔcH°liquid | -4022. | kJ/mol | Ccb | Schjanberg, 1935 |

References

Schjanberg, 1935
Schjanberg, E.,
Die Verbrennungswarmen und die Refraktionsdaten einiger chlorsubstituierter Fettsauren und Ester.,
Z. Phys. Chem. Abt. A, 1935, 172, 197-233. [all data]