1-Penten-3-one, 1-phenyl-
- Formula: C11H12O
- Molecular weight: 160.2124
- IUPAC Standard InChIKey: LVGUHATVVHIJET-CMDGGOBGSA-N
- CAS Registry Number: 3152-68-9
- Chemical structure:
View 3d structure (requires JavaScript / HTML 5) - Other names: Benzylidenemethyl ethyl ketone; Ethyl styryl ketone; Ethyl 2-phenylvinyl ketone; Styryl ethyl ketone; 1-Phenyl-1-penten-3-one; 1-phenylpent-1-en-3-one

Phase change data

Data compiled by: Robert L. Brown and Stephen E. Stein
Reduced pressure boiling point
Tboil (K) | Pressure (bar) | Reference |
---|---|---|
416. to 418. | 0.016 | Frinton Laboratories Inc., 1986 |

References

Frinton Laboratories Inc., 1986
Frinton Laboratories Inc.,
Catalog Number 11, Frinton Laboratories Inc., Vineland, NJ, 1986, 99. [all data]