Mexacarbate
- Formula: C12H16N2O2
- Molecular weight: 220.2676
- IUPAC Standard InChIKey: YNEVBPNZHBAYOA-UHFFFAOYSA-N
- CAS Registry Number: 315-18-4
- Chemical structure:
View 3d structure (requires JavaScript / HTML 5) - Other names: Phenol, 4-(dimethylamino)-3,5-dimethyl-, methylcarbamate (ester); Carbamic acid, methyl-, 4-(dimethylamino)-3,5-xylyl ester; Dowco 139; ENT 25,766; Mexicarbate; Zactran; Zectane; Zectran; Zextran; 4-(Dimethylamino)-3,5-Xylyl methylcarbamate; 4-Dimethylamino-3,5-dimethylphenyl N-methylcarbamate; 4-Dimethylamino-3,5-xylyl N-methylcarbamate; Phenol, 4-(dimethylamino)-3,5-dimethyl-, methylcarbamate; Carbamate, 4-dimethylamino-3,5-xylyl N-methyl-; Carbamic acid, methyl-, 4-(dimethylamino)-3,5-dimethylphenyl ester; 4-(Dimethylamine)-3,5-xylyl N-methylcarbamate; 4-(Dimethylamino)-3,5-dimethylphenol methylcarbamate; 4-(Dimethylamino)-3,5-xylenol, methylcarbamate; 4-(N,N-Dimethylamino)-3,5-xylyl N-methylcarbamate; ENT 25766; Methylcarbamic acid, 4-(dimethylamino)-3,5-xylyl ester; Methyl-4-dimethylamino-3,5-xylyl carbamate; Methyl-4-dimethylamino-3,5-xylyl ester of carbamic acid; NCI-C00544; OMS-47; OMS 639; 3,5-Xylenol, 4-(dimethylamino)-, methylcarbamate; Carbamic acid, 3,5-dimethyl-4-dimethylaminophenyl ester, N-methyl

Phase change data

Data compiled as indicated in comments:
TRC - Thermodynamics Research Center, NIST Boulder Laboratories, Chris Muzny director
AC - William E. Acree, Jr., James S. Chickos
Quantity | Value | Units | Method | Reference | Comment |
---|---|---|---|---|---|
Tfus | 362.06 | K | N/A | Donnelly, Drewes, et al., 1990 | Uncertainty assigned by TRC = 0.2 K; TRC |
Enthalpy of fusion
ΔfusH (kcal/mol) | Temperature (K) | Method | Reference | Comment |
---|---|---|---|---|
4.391 | 361.7 | DSC | Acree, 1991 | See also Donnelly, Drewes, et al., 1990, 2.; AC |
4.391 | 361.7 | DSC | Donnelly, Drewes, et al., 1990, 2 | AC |

References

Donnelly, Drewes, et al., 1990
Donnelly, J.R.; Drewes, L.A.; Johnson, R.L.; Munslow, W.D.; Knapp, K.K.; Sovocool, G.W.,
Purity and heat of fusion data for environmental standards as determined by differential scanning calorimetry,
Thermochim. Acta, 1990, 167, 2, 155, https://doi.org/10.1016/0040-6031(90)80476-F
. [all data]
Acree, 1991
Acree, William E.,
Thermodynamic properties of organic compounds: enthalpy of fusion and melting point temperature compilation,
Thermochimica Acta, 1991, 189, 1, 37-56, https://doi.org/10.1016/0040-6031(91)87098-H
. [all data]
Donnelly, Drewes, et al., 1990, 2
Donnelly, J.R.; Drewes, L.A.; Johnson, R.L.; Munslow, W.D.; Knapp, K.K.; Sovocool, G.W.,
Purity and heat of fusion data for environmental standards as determined by differential scanning calorimetry,
Thermochimica Acta, 1990, 167, 2, 155-187, https://doi.org/10.1016/0040-6031(90)80476-F
. [all data]