4-Hexen-1-yne, (E)-
- Formula: C6H8
- Molecular weight: 80.1277
- IUPAC Standard InChIKey: JLXNEPDKUYQIPV-GQCTYLIASA-N
- CAS Registry Number: 31516-63-9
- Chemical structure:
View 3d structure (requires JavaScript / HTML 5) - Stereoisomers:

Reaction thermochemistry data

Data compiled by: Hussein Y. Afeefy, Joel F. Liebman, and Stephen E. Stein
Individual Reactions
By formula: C6H8 = C6H8
Quantity | Value | Units | Method | Reference | Comment |
---|---|---|---|---|---|
ΔrH° | -8. ± 10. | kJ/mol | Kin | Hopf, Wachholz, et al., 1992 | gas phase; Heat of isomerization |

References

Hopf, Wachholz, et al., 1992
Hopf, H.; Wachholz, G.; Walsh, R.,
The kinetics of thermal isomerisation of 4-methyl-1,2,5-hexatriene in the gas phase,
Chem. Ber., 1992, 125, 711-721. [all data]