1-Nonen-4-yne
- Formula: C9H14
- Molecular weight: 122.2075
- IUPAC Standard InChIKey: GCZWNQLPRSOVNI-UHFFFAOYSA-N
- CAS Registry Number: 31508-12-0
- Chemical structure:
View 3d structure (requires JavaScript / HTML 5) - Permanent link for this species. Use this link for bookmarking this species for future reference.

Phase change data

Data compiled by: Robert L. Brown and Stephen E. Stein
Reduced pressure boiling point
Tboil (K) | Pressure (bar) | Reference |
---|---|---|
331. | 0.029 | Farchan Laboratories, 1990 |

References

Farchan Laboratories, 1990
Farchan Laboratories,
Research Chemicals Catalog, Farchan Laboratories, Gainesville, FL, 1990, 91. [all data]