2-Nonen-1-ol, (E)-
- Formula: C9H18O
- Molecular weight: 142.2386
- IUPAC Standard InChIKey: NSSALFVIQPAIQK-BQYQJAHWSA-N
- CAS Registry Number: 31502-14-4
- Chemical structure:
View 3d structure (requires JavaScript / HTML 5) - Stereoisomers:
- Other names: (E)-2-Nonen-1-ol; trans-2-Nonen-1-Ol; trans-2-Nonenol; (2E)-2-Nonen-1-ol; (E)-2-Nonenol; (E)-non-2-en-1-ol

Kovats' RI, non-polar column, custom temperature program

Column type | Active phase | I | Reference | Comment |
---|---|---|---|---|
Capillary | BP-1 | 1161. | Khan, Verma, et al., 2006 | 30. m/0.32 mm/0.25 μm, N2; Program: 60C => 5C/min => 220C (5min) => 3C/min => 245C(5min) |

Kovats' RI, polar column, temperature ramp

Column type | Active phase | I | Reference | Comment |
---|---|---|---|---|
Capillary | BP-20 | 1688. | Khan, Verma, et al., 2006 | 30. m/0.32 mm/0.25 μm, N2, 5. K/min, 220. C @ 14. min; Tstart: 60. C |

Van Den Dool and Kratz RI, non-polar column, temperature ramp

Column type | Active phase | I | Reference | Comment |
---|---|---|---|---|
Capillary | HP-5MS | 1171. | Kim, Shin, et al., 2001 | 30. m/0.25 mm/0.25 μm, He, 40. C @ 5. min, 2. K/min, 200. C @ 20. min |
Capillary | OV-101 | 1152. | Yang, Sugisawa, et al., 1992 | N2, 2. K/min; Column length: 50. m; Column diameter: 0.25 mm; Tstart: 80. C; Tend: 200. C |
Capillary | OV-101 | 1153. | Yang, Sugisawa, et al., 1992 | N2, 2. K/min; Column length: 50. m; Column diameter: 0.25 mm; Tstart: 80. C; Tend: 200. C |

Van Den Dool and Kratz RI, polar column, temperature ramp

Column type | Active phase | I | Reference | Comment |
---|---|---|---|---|
Capillary | DB-Wax | 1713. | Kim, Shin, et al., 2001 | 30. m/0.25 mm/0.25 μm, He, 40. C @ 5. min, 2. K/min, 200. C @ 20. min |

Normal alkane RI, non-polar column, temperature ramp

Column type | Active phase | I | Reference | Comment |
---|---|---|---|---|
Capillary | VF-5MS | 1216. | Fernandes, de Pinho, et al., 2009 | 30. m/0.25 mm/0.25 μm, Helium, 40. C @ 1. min, 2. K/min, 220. C @ 30. min |
Capillary | BPX-5 | 1120. | Kalua, Allen, et al., 2005 | 30. m/0.25 mm/0.25 μm, 40. C @ 8. min, 5. K/min, 200. C @ 10. min |
Capillary | OV-101 | 1153. | Yang, 2001 | N2, 2. K/min; Column length: 50. m; Column diameter: 0.25 mm; Tstart: 80. C; Tend: 200. C |
Capillary | OV-101 | 1152. | Tamura, Yang, et al., 1993 | 2. K/min; Column length: 50. m; Column diameter: 0.25 mm; Tstart: 80. C; Tend: 200. C |
Capillary | OV-101 | 1153. | Tamura, Yang, et al., 1993 | 2. K/min; Column length: 50. m; Column diameter: 0.25 mm; Tstart: 80. C; Tend: 200. C |
Capillary | DB-1 | 1149. | Flath, Mon, et al., 1983 | 50. C @ 0.1 min, 4. K/min, 250. C @ 5. min; Column length: 60. m; Column diameter: 0.32 mm |

Normal alkane RI, non-polar column, custom temperature program

Column type | Active phase | I | Reference | Comment |
---|---|---|---|---|
Capillary | BP-5 | 1181. | Eyres, Dufour, et al., 2005 | 25. m/0.32 mm/0.50 μm, Helium; Program: 60 0C 6 0C/min -> 210 0C 10 0C/min -> 290 0C (10 min) |
Capillary | BP-5 | 1172. | Eyres, Dufour, et al., 2005 | 25. m/0.32 mm/0.50 μm, Helium; Program: 60 0C 6 0C/min -> 210 0C 10 0C/min -> 290 0C (10 min) |
Capillary | BP-5 | 1173. | Eyres, Dufour, et al., 2005 | 25. m/0.32 mm/0.50 μm, Helium; Program: 60 0C 6 0C/min -> 210 0C 10 0C/min -> 290 0C (10 min) |
Capillary | BP-5 | 1175. | Eyres, Dufour, et al., 2005 | 25. m/0.32 mm/0.50 μm, Helium; Program: 60 0C 6 0C/min -> 210 0C 10 0C/min -> 290 0C (10 min) |
Capillary | BP-5 | 1176. | Eyres, Dufour, et al., 2005 | 25. m/0.32 mm/0.50 μm, Helium; Program: 60 0C 6 0C/min -> 210 0C 10 0C/min -> 290 0C (10 min) |
Capillary | BP-5 | 1178. | Eyres, Dufour, et al., 2005 | 25. m/0.32 mm/0.50 μm, Helium; Program: 60 0C 6 0C/min -> 210 0C 10 0C/min -> 290 0C (10 min) |
Capillary | BP-5 | 1181. | Eyres, Dufour, et al., 2005 | 25. m/0.32 mm/0.50 μm, Helium; Program: 60 0C 6 0C/min -> 210 0C 10 0C/min -> 290 0C (10 min) |
Capillary | SE-30 | 1157. | Vinogradov, 2004 | Program: not specified |

Normal alkane RI, polar column, temperature ramp

Column type | Active phase | I | Reference | Comment |
---|---|---|---|---|
Capillary | DB-Wax | 1703. | Umano, Hagi, et al., 2002 | 60. m/0.25 mm/0.25 μm, He, 40. C @ 2. min, 2. K/min; Tend: 200. C |
Capillary | DB-Wax | 1722. | Weckerle, Bastl-Borrmann, et al., 2001 | 30. m/0.25 mm/0.25 μm, He, 50. C @ 3. min, 4. K/min; Tend: 220. C |
Capillary | DB-Wax | 1715. | Takeoka, Flath, et al., 1988 | 60. m/0.25 mm/0.25 μm, H2, 30. C @ 2. min, 2. K/min; Tend: 180. C |
Capillary | DB-Wax | 1716. | Takeoka, Flath, et al., 1988 | 60. m/0.25 mm/0.25 μm, H2, 30. C @ 2. min, 2. K/min; Tend: 180. C |

Normal alkane RI, polar column, custom temperature program

Column type | Active phase | I | Reference | Comment |
---|---|---|---|---|
Capillary | Carbowax 20M | 1691. | Vinogradov, 2004 | Program: not specified |

References

Khan, Verma, et al., 2006
Khan, M.; Verma, S.C.; Srivastava, S.K.; Shawl, A.S.; Syamsundar, K.V.; Khanuja, S.P.S.; Kumar, T.,
Essential oil composition of Taxus wallichiana Zucc. from the Northern Himalayan region of India,
Flavour Fragr. J., 2006, 21, 5, 772-775, https://doi.org/10.1002/ffj.1682
. [all data]
Kim, Shin, et al., 2001
Kim, T.H.; Shin, J.H.; Baek, H.H.; Lee, H.J.,
Volatile flavour compounds in suspension culture of Agastache rugosa Kuntze (Korean mint),
J. Sci. Food Agric., 2001, 81, 6, 569-575, https://doi.org/10.1002/jsfa.845
. [all data]
Yang, Sugisawa, et al., 1992
Yang, R.; Sugisawa, H.; Nakatani, H.; Tamura, H.; Takagi, N.,
Comparison of odor quality in peel oils of acid citrus,
Nippon Shokuhin Kogyo Gakkaishi, 1992, 39, 1, 16-24, https://doi.org/10.3136/nskkk1962.39.16
. [all data]
Fernandes, de Pinho, et al., 2009
Fernandes, F.; de Pinho, P.G.; Valentao, P.; Pereira, J.A.; Andrade, P.B.,
Volatile constituents throughout Brassica oleracea L. var. acephala Germination,
J. Agric. Food Chem., 2009, 57, 15, 6795-6802, https://doi.org/10.1021/jf901532m
. [all data]
Kalua, Allen, et al., 2005
Kalua, C.M.; Allen, M.S.; Bedgood, D.R., Jr.; Bishop, A.G.; Prenzler, P.D.,
Discrimination of Olive Oils and Fruits into Cultivars and Maturity Stages Based on Phenolic and Volatile Compounds,
J. Agric. Food Chem., 2005, 53, 20, 8054-8062, https://doi.org/10.1021/jf051233i
. [all data]
Yang, 2001
Yang, R.,
Volatile compounds in peel oil of Citrus sudachi,
Food Sci. (Beijing), 2001, 22, 3, 71-73. [all data]
Tamura, Yang, et al., 1993
Tamura, H.; Yang, R.-H.; Sugisawa, H.,
Aroma profiles of peel oils of acid citrus,
ACS Sym. Ser., 1993, 525, 121-136. [all data]
Flath, Mon, et al., 1983
Flath, R.A.; Mon, T.R.; Lorenz, G.; Whitten, C.J.; Mackley, J.W.,
Volatile components of Acacia sp. blossoms,
J. Agric. Food Chem., 1983, 31, 6, 1167-1170, https://doi.org/10.1021/jf00120a008
. [all data]
Eyres, Dufour, et al., 2005
Eyres, G.; Dufour, J.-P.; Hallifax, G.; Sotheeswaran, S.; Marriott, P.J.,
Identification of character-impact odorants in coriander and wild coriander leaves using gas chromatography-olfactometry (GCO) and comprehensive two-dimensional gas chromatography-time-of-flight mass spectrometry (GC×GC-TOFMS),
J. Sep. Sci., 2005, 28, 9-10, 1061-1074, https://doi.org/10.1002/jssc.200500012
. [all data]
Vinogradov, 2004
Vinogradov, B.A.,
Production, composition, properties and application of essential oils, 2004, retrieved from http://viness.narod.ru. [all data]
Umano, Hagi, et al., 2002
Umano, K.; Hagi, Y.; Shibamoto, T.,
Volatile chemicals identified in extracts from newly hybrid citrus, dekopon (Shiranuhi mandarin Suppl. J.),
J. Agric. Food Chem., 2002, 50, 19, 5355-5359, https://doi.org/10.1021/jf0203951
. [all data]
Weckerle, Bastl-Borrmann, et al., 2001
Weckerle, B.; Bastl-Borrmann, R.; Richling, E.; Hör, K.; Ruff, C.; Schreier, P.,
Cactus pear (Opuntia ficus indica) flavour constituents - chiral evaluation (MDGC-MS) and isotope ratio (HRGC-IRMS) analysis,
Flavour Fragr. J., 2001, 16, 5, 360-363, https://doi.org/10.1002/ffj.1012
. [all data]
Takeoka, Flath, et al., 1988
Takeoka, G.R.; Flath, R.A.; Güntert, M.; Jennings, W.,
Nectarine volatiles: vacuum steam distillation versus headspace sampling,
J. Agric. Food Chem., 1988, 36, 3, 553-560, https://doi.org/10.1021/jf00081a037
. [all data]