Bromacil
- Formula: C9H13BrN2O2
- Molecular weight: 261.116
- IUPAC Standard InChIKey: CTSLUCNDVMMDHG-UHFFFAOYSA-N
- CAS Registry Number: 314-40-9
- Chemical structure:
View 3d structure (requires JavaScript / HTML 5) - Other names: 2,4(1H,3H)-Pyrimidinedione, 5-bromo-6-methyl-3-(1-methylpropyl)-; Uracil, 5-bromo-3-sec-butyl-6-methyl-; Bromazil; Herbicide 976; Hyvar X; Hyvar X bromacil; Hyvar X Weed Killer; Hyvar X-L; Hyvarex; Krovar II; Borea; Bromax; 5-Bromo-3-sec-butyl-6-methyluracil; 5-Bromo-6-methyl-3-(1-methylpropyl)-2,4(1H,3H)-pyrimidinedione; 5-Bromo-6-methyl-3-(1-methylpropyl)uracil; 3-sek.Butyl-5-brom-6-methyluracil; Cynogan; Du Pont herbicide 976; Eerex granular weed killer; Eerex water soluble concentrate weed killer; Hyvar X-WS; Nalkil; Uragan; Uragon; Urox B; Urox B water soluble concentrate weed killer; Urox-hx; Urox hx granular weed killer; Hyvar; Croptex onyx; Rokar X; 3-sek-Butyl-5-bromo-6-methyluracil

Phase change data

Data compiled as indicated in comments:
TRC - Thermodynamics Research Center, NIST Boulder Laboratories, Chris Muzny director
AC - William E. Acree, Jr., James S. Chickos
Quantity | Value | Units | Method | Reference | Comment |
---|---|---|---|---|---|
Tfus | 430.92 | K | N/A | Donnelly, Drewes, et al., 1990 | Uncertainty assigned by TRC = 0.2 K; TRC |
Enthalpy of fusion
ΔfusH (kcal/mol) | Temperature (K) | Method | Reference | Comment |
---|---|---|---|---|
5.263 | 428.3 | DSC | Acree, 1991 | See also Donnelly, Drewes, et al., 1990, 2.; AC |

Normal alkane RI, non-polar column, custom temperature program

Column type | Active phase | I | Reference | Comment |
---|---|---|---|---|
Capillary | 5 % Phenyl methyl siloxane | 1954. | Department of Food Safety and Welfare, 2006 | 30. m/0.25 mm/0.25 μm, Helium; Program: 50 0C(1 min) 25 0C/min -> 125 0C 10 0C/min -> 300 0C (10 min) |

References

Donnelly, Drewes, et al., 1990
Donnelly, J.R.; Drewes, L.A.; Johnson, R.L.; Munslow, W.D.; Knapp, K.K.; Sovocool, G.W.,
Purity and heat of fusion data for environmental standards as determined by differential scanning calorimetry,
Thermochim. Acta, 1990, 167, 2, 155, https://doi.org/10.1016/0040-6031(90)80476-F
. [all data]
Acree, 1991
Acree, William E.,
Thermodynamic properties of organic compounds: enthalpy of fusion and melting point temperature compilation,
Thermochimica Acta, 1991, 189, 1, 37-56, https://doi.org/10.1016/0040-6031(91)87098-H
. [all data]
Donnelly, Drewes, et al., 1990, 2
Donnelly, J.R.; Drewes, L.A.; Johnson, R.L.; Munslow, W.D.; Knapp, K.K.; Sovocool, G.W.,
Purity and heat of fusion data for environmental standards as determined by differential scanning calorimetry,
Thermochimica Acta, 1990, 167, 2, 155-187, https://doi.org/10.1016/0040-6031(90)80476-F
. [all data]
Department of Food Safety and Welfare, 2006
Department of Food Safety, Ministry of Health; Welfare,
Analytical methods for residual compositional substances of agricultural chemicals, feed aadditives, and veterinary drugs in foods, 2006, retrieved from http://www.mhlw.go.jp/english/topics/foodsafety/positivelist060228/de/060526-1a.pdf. [all data]