2-Pentanone, O-methyloxime
- Formula: C6H13NO
- Molecular weight: 115.1735
- IUPAC Standard InChIKey: CMUPRWBXGFPVTG-UHFFFAOYSA-N
- CAS Registry Number: 31377-00-1
- Chemical structure:
View 3d structure (requires JavaScript / HTML 5) - Permanent link for this species. Use this link for bookmarking this species for future reference.

Normal alkane RI, non-polar column, temperature ramp

Column type | Active phase | I | Reference | Comment |
---|---|---|---|---|
Capillary | OV-101 | 781. | Zenkevich, 2005 | 25. m/0.20 mm/0.10 μm, N2/He, 6. K/min; Tstart: 50. C; Tend: 250. C |

References

Zenkevich, 2005
Zenkevich, I.G.,
Experimentally measured retention indices., 2005. [all data]