Benz[a]anthracene, 1,12-dimethyl-
- Formula: C20H16
- Molecular weight: 256.3410
- IUPAC Standard InChIKey: XDOAGYHDDFESMV-UHFFFAOYSA-N
- CAS Registry Number: 313-74-6
- Chemical structure:
View 3d structure (requires JavaScript / HTML 5) - Other names: 1,12-Dimethylbenz[a]anthracene; 1',9-Dimethyl-1,2-benzanthracene; Benz[b]anthracene, 7,12-dimethyl; 1,12-Dimethylbenzo[a]anthracene

Condensed phase thermochemistry data

Data compiled by: Hussein Y. Afeefy, Joel F. Liebman, and Stephen E. Stein
Quantity | Value | Units | Method | Reference | Comment |
---|---|---|---|---|---|
ΔfH°solid | 138.9 ± 2.8 | kJ/mol | Ccb | Frisch, Barker, et al., 1963 | see Karnes, Kybett, et al., 1965 and Frisch, 1962 |
Quantity | Value | Units | Method | Reference | Comment |
ΔcH°solid | -10295.8 ± 2.0 | kJ/mol | Ccb | Frisch, Barker, et al., 1963 | see Karnes, Kybett, et al., 1965 and Frisch, 1962; Corresponding ΔfHºsolid = 139.0 kJ/mol (simple calculation by NIST; no Washburn corrections) |

Phase change data

Data compiled by: William E. Acree, Jr., James S. Chickos
Enthalpy of vaporization
ΔvapH (kJ/mol) | Temperature (K) | Method | Reference | Comment |
---|---|---|---|---|
88.9 | 398. | GC | Lei, Chankalal, et al., 2002 | Based on data from 323. to 473. K. |
107.8 | 379. to 396. | A | Stephenson and Malanowski, 1987 | See also Kelley and Rice, 1964. |
112.9 | 402. | A,ME | Stephenson and Malanowski, 1987 | Based on data from 396. to 408. K. See also Ratcliffe and Shreeve, 1964 and Dykyj, Svoboda, et al., 1999. |
Enthalpy of sublimation
ΔsubH (kJ/mol) | Temperature (K) | Method | Reference | Comment |
---|---|---|---|---|
135. | 379. to 390. | A | Stephenson and Malanowski, 1987 | See also Kelley and Rice, 1964. |

Van Den Dool and Kratz RI, non-polar column, temperature ramp

Column type | Active phase | I | Reference | Comment |
---|---|---|---|---|
Capillary | DB-5 | 2822. | Rostad and Pereira, 1986 | 30. m/0.26 mm/0.25 μm, He, 50. C @ 4. min, 6. K/min, 300. C @ 20. min |

Lee's RI, non-polar column, temperature ramp

Column type | Active phase | I | Reference | Comment |
---|---|---|---|---|
Capillary | DB-5 | 440.30 | Rostad and Pereira, 1986 | 30. m/0.26 mm/0.25 μm, He, 50. C @ 4. min, 6. K/min, 300. C @ 20. min |
Capillary | SE-52 | 436.82 | Lee, Vassilaros, et al., 1979 | 12. m/0.3 mm/0.34 μm, He, 2. K/min; Tstart: 50. C; Tend: 250. C |

Lee's RI, non-polar column, custom temperature program

Column type | Active phase | I | Reference | Comment |
---|---|---|---|---|
Capillary | LM-5 | 436.43 | Ré-Poppi and Santiago-Silva, 2005 | 30. m/0.25 mm/0.25 μm, He; Program: 60C(2min) => 15C/min => 180C => 5C/min => 280C (10min) |
Capillary | SE-52 | 436.82 | Shlyakhov, 1984 | Program: not specified |

References

Frisch, Barker, et al., 1963
Frisch, M.A.; Barker, C.; Margrave, J.L.; Newman, M.S.,
Strain energies in hydrocarbons from heats to combustion. I. 4,5-and 2,7-dimethylphenanthrenes, 1,12- and 5,8-benzo(c)phenanthrenes and 1',9- and 3',6-benzanthracenes,
J. Am. Chem. Soc., 1963, 85, 2356-2357. [all data]
Karnes, Kybett, et al., 1965
Karnes, H.A.; Kybett, B.D.; Wilson, M.H.; Margrave, J.L.; Newman, M.S.,
Strain energies in hydrocarbons from heats of combustion. III. 3,4,5,6- and 2,4,5,7-tetramethylphenanthrenes,
J. Am. Chem. Soc., 1965, 87, 5554-5558. [all data]
Frisch, 1962
Frisch, M.A.,
A high precision calorimeter for ther measurement of small energy differences, Ph.D. Thesis for University of Wisconsin, 1962, 1-100. [all data]
Lei, Chankalal, et al., 2002
Lei, Ying Duan; Chankalal, Raymond; Chan, Anita; Wania, Frank,
Supercooled Liquid Vapor Pressures of the Polycyclic Aromatic Hydrocarbons,
J. Chem. Eng. Data, 2002, 47, 4, 801-806, https://doi.org/10.1021/je0155148
. [all data]
Stephenson and Malanowski, 1987
Stephenson, Richard M.; Malanowski, Stanislaw,
Handbook of the Thermodynamics of Organic Compounds, 1987, https://doi.org/10.1007/978-94-009-3173-2
. [all data]
Kelley and Rice, 1964
Kelley, J. Daniel; Rice, Francis Owen,
The Vapor Pressures of Some Polynuclear Aromatic Hydrocarbons 1,
J. Phys. Chem., 1964, 68, 12, 3794-3796, https://doi.org/10.1021/j100794a043
. [all data]
Ratcliffe and Shreeve, 1964
Ratcliffe, Charles T.; Shreeve, Jean'ne M.,
Reactions of Peroxodisulfuryl Difluoride with Organic Halides,
Inorg. Chem., 1964, 3, 5, 631-633, https://doi.org/10.1021/ic50015a005
. [all data]
Dykyj, Svoboda, et al., 1999
Dykyj, J.; Svoboda, J.; Wilhoit, R.C.; Frenkel, M.L.; Hall, K.R.,
Vapor Pressure of Chemicals: Part A. Vapor Pressure and Antoine Constants for Hydrocarbons and Sulfur, Selenium, Tellurium and Hydrogen Containing Organic Compounds, Springer, Berlin, 1999, 373. [all data]
Rostad and Pereira, 1986
Rostad, C.E.; Pereira, W.E.,
Kovats and Lee retention indices determined by gas chromatography/mass spectrometry for organic compounds of environmental interest,
J. Hi. Res. Chromatogr. Chromatogr. Comm., 1986, 9, 6, 328-334, https://doi.org/10.1002/jhrc.1240090603
. [all data]
Lee, Vassilaros, et al., 1979
Lee, M.L.; Vassilaros, D.L.; White, C.M.; Novotny, M.,
Retention Indices for Programmed-Temperature Capillary-Column Gas Chromatography of Polycyclic Aromatic Hydrocarbons,
Anal. Chem., 1979, 51, 6, 768-773, https://doi.org/10.1021/ac50042a043
. [all data]
Ré-Poppi and Santiago-Silva, 2005
Ré-Poppi, N.; Santiago-Silva, M.,
Polycyclic aromatic hydrocarbons and other selected organic compounds in ambient air of Campo Grande City, Brazil,
Atmos. Environ., 2005, 39, 16, 2839-2850, https://doi.org/10.1016/j.atmosenv.2004.10.006
. [all data]
Shlyakhov, 1984
Shlyakhov, A.F.,
Gas chromatography in organic geochemistry, Nedra, Moscow, 1984, 221. [all data]