2-Heptanol, 3-methyl-
- Formula: C8H18O
- Molecular weight: 130.2279
- IUPAC Standard InChIKey: SZERMVMTUUAYML-UHFFFAOYSA-N
- CAS Registry Number: 31367-46-1
- Chemical structure:
View 3d structure (requires JavaScript / HTML 5) - Other names: 3-Methyl-2-heptanol

Condensed phase thermochemistry data

Data compiled by: Eugene S. Domalski and Elizabeth D. Hearing
Constant pressure heat capacity of liquid
Cp,liquid (J/mol*K) | Temperature (K) | Reference | Comment |
---|---|---|---|
297.5 | 298.5 | Cline and Andrews, 1931 | T = 102 to 298 K. Value is unsmoothed experimental datum. |

Phase change data

Data compiled as indicated in comments:
BS - Robert L. Brown and Stephen E. Stein
TRC - Thermodynamics Research Center, NIST Boulder Laboratories, Chris Muzny director
AC - William E. Acree, Jr., James S. Chickos
Quantity | Value | Units | Method | Reference | Comment |
---|---|---|---|---|---|
Tboil | 439.3 | K | N/A | Weast and Grasselli, 1989 | BS |
Tboil | 439.25 | K | N/A | Dorough, Glass, et al., 1941 | Uncertainty assigned by TRC = 0.5 K; TRC |
Tboil | 445.65 | K | N/A | Powell, 1924 | Uncertainty assigned by TRC = 3. K; TRC |
Enthalpy of vaporization
ΔvapH (kJ/mol) | Temperature (K) | Method | Reference | Comment |
---|---|---|---|---|
48.0 | 356. | A | Stephenson and Malanowski, 1987 | Based on data from 341. to 440. K. See also Wilhoit and Zwolinski, 1973.; AC |

References

Cline and Andrews, 1931
Cline, J.K.; Andrews, D.H.,
Thermal energy studies. III. The octanols,
J. Am. Chem. Soc., 1931, 53, 3668-3673. [all data]
Weast and Grasselli, 1989
CRC Handbook of Data on Organic Compounds, 2nd Editon, Weast,R.C and Grasselli, J.G., ed(s)., CRC Press, Inc., Boca Raton, FL, 1989, 1. [all data]
Dorough, Glass, et al., 1941
Dorough, G.L.; Glass, H.B.; Gresham, T.L.; Malone, G.B.; Reid, E.E.,
Structure-property relationships in some isomeric octanols,
J. Am. Chem. Soc., 1941, 63, 3100. [all data]
Powell, 1924
Powell, S.G.,
J. Am. Chem. Soc., 1924, 46, 2514. [all data]
Stephenson and Malanowski, 1987
Stephenson, Richard M.; Malanowski, Stanislaw,
Handbook of the Thermodynamics of Organic Compounds, 1987, https://doi.org/10.1007/978-94-009-3173-2
. [all data]
Wilhoit and Zwolinski, 1973
Wilhoit, R.C.; Zwolinski, B.J.,
Physical and thermodynamic properties of aliphatic alcohols,
J. Phys. Chem. Ref. Data Suppl., 1973, 1, 2, 1. [all data]