Benzaldehyde, 3-bromo-
- Formula: C7H5BrO
- Molecular weight: 185.018
- IUPAC Standard InChIKey: SUISZCALMBHJQX-UHFFFAOYSA-N
- CAS Registry Number: 3132-99-8
- Chemical structure:
View 3d structure (requires JavaScript / HTML 5) - Other names: m-Bromobenzaldehyde; 3-Bromobenzaldehyde; Benzaldehyde, m-bromo-

Phase change data

Data compiled by: Robert L. Brown and Stephen E. Stein
Quantity | Value | Units | Method | Reference | Comment |
---|---|---|---|---|---|
Tboil | 502.2 | K | N/A | Aldrich Chemical Company Inc., 1990 | |
Tboil | 507.7 | K | N/A | Weast and Grasselli, 1989 | |
Tboil | 506. to 509. | K | N/A | Buckingham and Donaghy, 1982 |
Reduced pressure boiling point
Tboil (K) | Pressure (bar) | Reference |
---|---|---|
339. to 341. | 0.003 | Buckingham and Donaghy, 1982 |

Kovats' RI, non-polar column, isothermal

Column type | Active phase | Temperature (C) | I | Reference | Comment |
---|---|---|---|---|---|
Packed | OV-101 | 140. | 1193.5 | Righezza, Hassani, et al., 1996 | N2, Chromosorb G HP; Column length: 5. m |
Packed | OV-101 | 160. | 1207.8 | Hassani and Meklati, 1992 | N2, Chromosorb G HP; Column length: 5. m |

Normal alkane RI, non-polar column, custom temperature program

Column type | Active phase | I | Reference | Comment |
---|---|---|---|---|
Capillary | OV-101 | 1186. | Ebrahimi and Hadjmohammadi, 2006 | Program: not specified |

References

Aldrich Chemical Company Inc., 1990
Aldrich Chemical Company Inc.,
Catalog Handbook of Fine Chemicals, Aldrich Chemical Company, Inc., Milwaukee WI, 1990, 1. [all data]
Weast and Grasselli, 1989
CRC Handbook of Data on Organic Compounds, 2nd Editon, Weast,R.C and Grasselli, J.G., ed(s)., CRC Press, Inc., Boca Raton, FL, 1989, 1. [all data]
Buckingham and Donaghy, 1982
Buckingham, J.; Donaghy, S.M.,
Dictionary of Organic Compounds: Fifth Edition, Chapman and Hall, New York, 1982, 1. [all data]
Righezza, Hassani, et al., 1996
Righezza, M.; Hassani, A.; Meklati, B.Y.; Chrétien, J.R.,
Quantitative structure-retention relationships (QSRR) of congeneric aromatics series studied on phenyl OV phases in gas chromatography,
J. Chromatogr. A, 1996, 723, 1, 77-91, https://doi.org/10.1016/0021-9673(95)00816-0
. [all data]
Hassani and Meklati, 1992
Hassani, A.; Meklati, B.Y.,
Gas chromatographic behaviour of monosubstituted benzenes, benzaldehydes and acetophenones on OV polymethylphenyl-silicone stationary phases,
Chromatographia, 1992, 33, 5/6, 267-271, https://doi.org/10.1007/BF02276193
. [all data]
Ebrahimi and Hadjmohammadi, 2006
Ebrahimi, P.; Hadjmohammadi, M.R.,
Simultaneous modeling of the Kovats retention indices on phenyl OV stationary phases with different polarity using MLR and ANN,
QSAR Comb. Sci., 2006, 25, 10, 836-845, https://doi.org/10.1002/qsar.200530145
. [all data]