Methylchlorocarbene
- Formula: C2H3Cl
- Molecular weight: 62.498
- IUPAC Standard InChIKey: UZDUCWWOMGDMKU-UHFFFAOYSA-N
- CAS Registry Number: 31304-51-5
- Chemical structure:
View 3d structure (requires JavaScript / HTML 5) - Permanent link for this species. Use this link for bookmarking this species for future reference.

Gas phase thermochemistry data

Data compiled by: Hussein Y. Afeefy, Joel F. Liebman, and Stephen E. Stein
Quantity | Value | Units | Method | Reference | Comment |
---|---|---|---|---|---|
ΔfH°gas | 212. ± 20. | kJ/mol | Cm | LaVilla and Goodman, 1989 | Heat of reaction[kcal/mol]=27.5±3.0 |

Reaction thermochemistry data

Data compiled by: Hussein Y. Afeefy, Joel F. Liebman, and Stephen E. Stein
Individual Reactions
By formula: C2H3Cl = C2H3Cl
Quantity | Value | Units | Method | Reference | Comment |
---|---|---|---|---|---|
ΔrH° | -176. ± 15. | kJ/mol | Cm | LaVilla and Goodman, 1989 | gas phase; solvent: Heptane |

References

LaVilla and Goodman, 1989
LaVilla, J.A.; Goodman, J.L.,
The 1,2-hydrogen-shift rearrangement in alkylchlorocarbenes,
J. Am. Chem. Soc., 1989, 111, 6877-6878. [all data]