Desmosterol
- Formula: C27H44O
- Molecular weight: 384.6377
- IUPAC Standard InChIKey: AVSXSVCZWQODGV-VUDDDUNTSA-N
- CAS Registry Number: 313-04-2
- Chemical structure:

Phase change data

Data compiled by: William E. Acree, Jr., James S. Chickos
Enthalpy of fusion
ΔfusH (kJ/mol) | Temperature (K) | Method | Reference |
---|---|---|---|
15.9 | 388.2 | DSC | Chen, Su, et al., 2009 |

Kovats' RI, non-polar column, isothermal

Column type | Active phase | Temperature (C) | I | Reference | Comment |
---|---|---|---|---|---|
Capillary | Methyl Silicone | 250. | 3155. | Shlyakhov, 1984 |

Van Den Dool and Kratz RI, non-polar column, temperature ramp

Column type | Active phase | I | Reference | Comment |
---|---|---|---|---|
Capillary | VF-5MS | 3163. | Todua, 2011 | 30. m/0.25 mm/0.25 μm, He; Tstart: 60. C; Tend: 270. C |

Normal alkane RI, non-polar column, custom temperature program

Column type | Active phase | I | Reference | Comment |
---|---|---|---|---|
Capillary | OV-1, SE-30, Methyl silicone, SP-2100, OV-101, DB-1, etc. | 3125. | Waggott and Davies, 1984 | Hydrogen; Column length: 50. m; Column diameter: 0.32 mm; Program: not specified |

References

Chen, Su, et al., 2009
Chen, Wei; Su, Baogen; Xing, Huabin; Yang, Yiwen; Ren, Qilong,
Solubilities of cholesterol and desmosterol in binary solvent mixtures of n-hexane+ethanol,
Fluid Phase Equilibria, 2009, 287, 1, 1-6, https://doi.org/10.1016/j.fluid.2009.08.016
. [all data]
Shlyakhov, 1984
Shlyakhov, A.F.,
Gas chromatography in organic geochemistry, Nedra, Moscow, 1984, 221. [all data]
Todua, 2011
Todua, N.G.,
Retention Data. NIST Mass Spectrometry Data Center., NIST Mass Spectrometry Data Center, 2011. [all data]
Waggott and Davies, 1984
Waggott, A.; Davies, I.W.,
Identification of organic pollutants using linear temperature programmed retention indices (LTPRIs) - Part II, 1984, retrieved from http://dwi.defra.gov.uk/research/completed-research/reports/dwi0383.pdf. [all data]