Sulfur fluoride anion
- Formula: FS-
- Molecular weight: 51.064
- CAS Registry Number: 31296-43-2

Reaction thermochemistry data

Data compiled by: John E. Bartmess
Individual Reactions
By formula: (FS- • 4294967295S) + S = FS-
Quantity | Value | Units | Method | Reference | Comment |
---|---|---|---|---|---|
ΔrH° | 236. ± 6.3 | kJ/mol | N/A | Polak, Gilles, et al., 1992 | gas phase |
FS- + = HFS
Quantity | Value | Units | Method | Reference | Comment |
---|---|---|---|---|---|
ΔrH° | 1449. ± 15. | kJ/mol | D-EA | Polak, Gilles, et al., 1992 | gas phase |

Gas phase ion energetics data

Data compiled by: John E. Bartmess
Protonation reactions
FS- + = HFS
Quantity | Value | Units | Method | Reference | Comment |
---|---|---|---|---|---|
ΔrH° | 1449. ± 15. | kJ/mol | D-EA | Polak, Gilles, et al., 1992 | gas phase |

Gas phase thermochemistry data

Quantity | Value | Units | Method | Reference | Comment |
---|---|---|---|---|---|
S°gas,1 bar | 218.95 | J/mol*K | Review | Chase, 1998 | Data last reviewed in December, 1976 |

Ion clustering data

Data compiled by: John E. Bartmess
Clustering reactions
By formula: (FS- • 4294967295S) + S = FS-
Quantity | Value | Units | Method | Reference | Comment |
---|---|---|---|---|---|
ΔrH° | 236. ± 6.3 | kJ/mol | N/A | Polak, Gilles, et al., 1992 | gas phase |

References

Polak, Gilles, et al., 1992
Polak, M.L.; Gilles, M.K.; Lineberger, W.C.,
Photoelectron Spectroscopy of SF-,
J. Chem. Phys., 1992, 96, 9, 7191, https://doi.org/10.1063/1.462526
. [all data]