Sulfur fluoride cation
- Formula: FS+
- Molecular weight: 51.063
- CAS Registry Number: 31296-42-1

Gas phase thermochemistry data

Quantity | Value | Units | Method | Reference | Comment |
---|---|---|---|---|---|
S°gas,1 bar | 225.38 | J/mol*K | Review | Chase, 1998 | Data last reviewed in June, 1976 |

References

Chase, 1998
Chase, M.W., Jr.,
NIST-JANAF Themochemical Tables, Fourth Edition,
J. Phys. Chem. Ref. Data, Monograph 9, 1998, 1-1951. [all data]