Heptane, 4-iodo-
- Formula: C7H15I
- Molecular weight: 226.0985
- IUPAC Standard InChIKey: OQRWLPBTVGINDN-UHFFFAOYSA-N
- CAS Registry Number: 31294-93-6
- Chemical structure:
View 3d structure (requires JavaScript / HTML 5) - Other names: 4-Iodoheptane

Phase change data

Data compiled by: Robert L. Brown and Stephen E. Stein
Reduced pressure boiling point
Tboil (K) | Pressure (atm) | Reference |
---|---|---|
339.2 | 0.01 | Weast and Grasselli, 1989 |

Kovats' RI, non-polar column, isothermal

Column type | Active phase | Temperature (C) | I | Reference | Comment |
---|---|---|---|---|---|
Packed | Apiezon L | 75. | 1121. | Castello, 1984 | N2, Chromosorb W DMCS; Column length: 3. m |

Kovats' RI, polar column, isothermal

Column type | Active phase | Temperature (C) | I | Reference | Comment |
---|---|---|---|---|---|
Packed | Carbowax 20M | 75. | 1265. | Castello, 1984 | N2, Chromosorb W DMCS; Column length: 3. m |

Normal alkane RI, non-polar column, isothermal

Column type | Active phase | Temperature (C) | I | Reference | Comment |
---|---|---|---|---|---|
Capillary | Apiezon L | 130. | 1061. | Arruda, Junkes, et al., 2008 |

References

Weast and Grasselli, 1989
CRC Handbook of Data on Organic Compounds, 2nd Editon, Weast,R.C and Grasselli, J.G., ed(s)., CRC Press, Inc., Boca Raton, FL, 1989, 1. [all data]
Castello, 1984
Castello, G.,
Gas Chromatographic Identification of Alkyl Radicals Formed in Plasma Radiofrequency Discharges by Using Iodine as a Scavenger,
J. Chromatogr., 1984, 303, 61-66, https://doi.org/10.1016/S0021-9673(01)96045-5
. [all data]
Arruda, Junkes, et al., 2008
Arruda, A.C.S.; Junkes, B. da.S.; Souza, E.S.; Yunes, R.A.; Heizen, V.E.F.,
Semi-Emlirical Topological Index to Predict Properties of Halogenated Aliphatic Compounds,
J. Chemometrics, 2008, 22, 3-4, 186-194, https://doi.org/10.1002/cem.1121
. [all data]