Methylene, diphenyl-
- Formula: C13H10
- Molecular weight: 166.2185
- IUPAC Standard InChIKey: XMGMFRIEKMMMSU-UHFFFAOYSA-N
- CAS Registry Number: 3129-17-7
- Chemical structure:

Reaction thermochemistry data

Data compiled by: Hussein Y. Afeefy, Joel F. Liebman, and Stephen E. Stein
Individual Reactions
By formula: C13H10N2 = C13H10 + N2
Quantity | Value | Units | Method | Reference | Comment |
---|---|---|---|---|---|
ΔrH° | 0.0 ± 7.1 | kJ/mol | Cm | Simon and Peters, 1983 | liquid phase; solvent: Benzene; Corrected by authors in 1988 |

References

Simon and Peters, 1983
Simon, J.D.; Peters, K.S.,
Determination of the heat of reaction for the formation of diphenylcarbene from diphenyldiazomethane using photoacoustic calorimetry,
J. Am. Chem. Soc., 1983, 105, 5156-5158. [all data]