4-Benzylpiperidine
- Formula: C12H17N
- Molecular weight: 175.2701
- IUPAC Standard InChIKey: ABGXADJDTPFFSZ-UHFFFAOYSA-N
- CAS Registry Number: 31252-42-3
- Chemical structure:
View 3d structure (requires JavaScript / HTML 5) - Other names: Piperidine, 4-(phenylmethyl)-; Piperidine, 4-benzyl-; 4-(Phenylmethyl)piperidine

Phase change data

Data compiled as indicated in comments:
BS - Robert L. Brown and Stephen E. Stein
AC - William E. Acree, Jr., James S. Chickos
Quantity | Value | Units | Method | Reference | Comment |
---|---|---|---|---|---|
Tboil | 552.2 | K | N/A | Weast and Grasselli, 1989 | BS |
Quantity | Value | Units | Method | Reference | Comment |
Tfus | 279. to 280. | K | N/A | Buckingham and Donaghy, 1982 | BS |
Quantity | Value | Units | Method | Reference | Comment |
ΔvapH° | 74.2 ± 1.0 | kJ/mol | C | Ribeiro da Silva and Cabral, 2007 | AC |
Reduced pressure boiling point
Tboil (K) | Pressure (bar) | Reference | Comment |
---|---|---|---|
424.2 | 0.023 | Weast and Grasselli, 1989 | BS |
423. to 425. | 0.023 | Buckingham and Donaghy, 1982 | BS |

References

Weast and Grasselli, 1989
CRC Handbook of Data on Organic Compounds, 2nd Editon, Weast,R.C and Grasselli, J.G., ed(s)., CRC Press, Inc., Boca Raton, FL, 1989, 1. [all data]
Buckingham and Donaghy, 1982
Buckingham, J.; Donaghy, S.M.,
Dictionary of Organic Compounds: Fifth Edition, Chapman and Hall, New York, 1982, 1. [all data]
Ribeiro da Silva and Cabral, 2007
Ribeiro da Silva, M.A.V.; Cabral, Joana I.T.A.,
Thermochemical properties of three piperidine derivatives,
J Therm Anal Calorim, 2007, 90, 3, 865-871, https://doi.org/10.1007/s10973-007-8316-0
. [all data]