Diphenyl lead dibromide
- Formula: C12H10Br2Pb
- Molecular weight: 521.2
- CAS Registry Number: 3124-29-6

Condensed phase thermochemistry data

Data compiled by: José A. Martinho Simões
Quantity | Value | Units | Method | Reference | Comment |
---|---|---|---|---|---|
ΔfH°solid | 36. ± 18. | kJ/mol | Review | Martinho Simões | The enthalpy of formation relies on 515. ± 15. kJ/mol for the enthalpy of formation of Pb(Ph)4(cr). |

Phase change data

Data compiled as indicated in comments:
AC - William E. Acree, Jr., James S. Chickos
MS - José A. Martinho Simões
Quantity | Value | Units | Method | Reference | Comment |
---|---|---|---|---|---|
ΔsubH° | 141.8 ± 0.8 | kJ/mol | ME | Golovanova, Sitonina, et al., 1988 | Based on data from 298. to 398. K. See also Butler, Carson, et al., 1976.; AC |
ΔsubH° | 141.8 ± 0.8 | kJ/mol | RSC | Butler R.S., Carson, et al., 1976 | MS |

References

Martinho Simões
Martinho Simões, J.A.,
Private communication (see http://webbook.nist.gov/chemistry/om/). [all data]
Golovanova, Sitonina, et al., 1988
Golovanova, O.F.; Sitonina, G.V.; Pepekin, v.I.; Korsunskii, B.L.; Dubovitskii, F.I.,
Kinetic and thermochemical studies of N-nitro and N-nitrosomorpholine,
Bull. Acad. Sci. USSR, Div. Chem. Sci., 1988, 881-886. [all data]
Butler, Carson, et al., 1976
Butler, R.S.; Carson, A.S.; Laye, P.G.; Steele, W.V.,
Thermochemical studies on the halogenation of tetraphenyllead,
The Journal of Chemical Thermodynamics, 1976, 8, 12, 1153-1158, https://doi.org/10.1016/0021-9614(76)90122-1
. [all data]
Butler R.S., Carson, et al., 1976
Butler R.S.; Carson, A.S.; Laye, P.G.; Steele, W.V.,
J. Chem. Thermodyn., 1976, 8, 1153. [all data]