Silane, difluorodiphenyl-
- Formula: C12H10F2Si
- Molecular weight: 220.2901
- IUPAC Standard InChIKey: BOMPXIHODLVNMC-UHFFFAOYSA-N
- CAS Registry Number: 312-40-3
- Chemical structure:
View 3d structure (requires JavaScript / HTML 5) - Other names: Diphenyldifluorosilane; Difluorodiphenylsilane; Diphenylsilane difluoride

Phase change data

Data compiled as indicated in comments:
BS - Robert L. Brown and Stephen E. Stein
AC - William E. Acree, Jr., James S. Chickos
Reduced pressure boiling point
Tboil (K) | Pressure (atm) | Reference | Comment |
---|---|---|---|
430. | 0.066 | PCR Inc., 1990 | BS |
Enthalpy of vaporization
ΔvapH (kcal/mol) | Temperature (K) | Method | Reference | Comment |
---|---|---|---|---|
12.1 | 407. | A | Stephenson and Malanowski, 1987 | Based on data from 392. to 516. K.; AC |

References

PCR Inc., 1990
PCR Inc.,
Research Chemicals Catalog 1990-1991, PCR Inc., Gainesville, FL, 1990, 1. [all data]
Stephenson and Malanowski, 1987
Stephenson, Richard M.; Malanowski, Stanislaw,
Handbook of the Thermodynamics of Organic Compounds, 1987, https://doi.org/10.1007/978-94-009-3173-2
. [all data]