Bicyclo[3.1.0]hexan-3-ol, 4-methyl-1-(1-methylethyl)-, (1α,3β,4β,5α)-
- Formula: C10H18O
- Molecular weight: 154.2493
- IUPAC Standard InChIKey: DZVXRFMREAADPP-ITRGKUQCSA-N
- CAS Registry Number: 31187-53-8
- Chemical structure:
View 3d structure (requires JavaScript / HTML 5) - Stereoisomers:
- neo-Thujan-3-ol
- neo-Isothujan-3-ol
- Bicyclo[3.1.0]hexan-3-ol, 4-methyl-1-(1-methylethyl)-, [1S-(1α,3α,4α,5α)]-
- Thujol
- Bicyclo[3.1.0]hexan-3-ol, 4-methyl-1-(1-methylethyl)-
- (1S,3S,4S,5R)-1-Isopropyl-4-methylbicyclo[3.1.0]hexan-3-ol
- cis-Thujanol
- Iso-3-Thujol
- Neo-3-Thujol
- Neo iso-3-Thujol
- neo-iso-Thujanol
- iso-3-Thujanol
- Other names: Neoisothujyl alcohol; 1-Isopropyl-4-methylbicyclo[3.1.0]hexan-3-ol-, (1α,3β,4β,5α)-; Neoisothujol

Van Den Dool and Kratz RI, polar column, temperature ramp

Column type | Active phase | I | Reference | Comment |
---|---|---|---|---|
Capillary | DB-Wax | 1694. | Shiratsuchi, Shimoda, et al., 1993 | 60. m/0.25 mm/0.25 μm, 50. C @ 4. min, 2. K/min, 230. C @ 30. min |

Normal alkane RI, polar column, temperature ramp

Column type | Active phase | I | Reference | Comment |
---|---|---|---|---|
Capillary | DB-Wax | 1694. | Shimoda, Shiratsuchi, et al., 1993 | 60. m/0.25 mm/0.25 μm, He, 50. C @ 4. min, 2. K/min; Tend: 230. C |

References

Shiratsuchi, Shimoda, et al., 1993
Shiratsuchi, H.; Shimoda, M.; Minegishi, Y.; Osajima, Y.,
Isolation and identification of volatile flavor compounds in nonfermented coarse-cut sausage. Flavor as a quality factor of nonfermented sausage. 1,
J. Agric. Food Chem., 1993, 41, 4, 647-652, https://doi.org/10.1021/jf00028a027
. [all data]
Shimoda, Shiratsuchi, et al., 1993
Shimoda, M.; Shiratsuchi, H.; Minegishi, Y.; Osajima, Y.,
Flavor deterioration of nonfermented coarse-cut sausage during storage. Flavor as a factor of quality for nonfermented sausage. 2,
J. Agric. Food Chem., 1993, 41, 6, 946-950, https://doi.org/10.1021/jf00030a021
. [all data]