Butane, 1-(ethylsulfonyl)-
- Formula: C6H14O2S
- Molecular weight: 150.239
- IUPAC Standard InChIKey: PVSJGAIWOIMZFG-UHFFFAOYSA-N
- CAS Registry Number: 31124-38-6
- Chemical structure:
View 3d structure (requires JavaScript / HTML 5) - Other names: Sulfone, butyl ethyl; Butyl ethyl sulfone

Phase change data

Data compiled by: Thermodynamics Research Center, NIST Boulder Laboratories, Chris Muzny director
Quantity | Value | Units | Method | Reference | Comment |
---|---|---|---|---|---|
Tfus | 357. | K | N/A | Kaldor and Hammond, 1991 | Uncertainty assigned by TRC = 2. K |
Tfus | 323. | K | N/A | Michalski, Wieczorkowski, et al., 1958 | Uncertainty assigned by TRC = 4. K |
Tfus | 321. | K | N/A | Idson and Spoerri, 1954 | Uncertainty assigned by TRC = 4. K |
Tfus | 322.2 | K | N/A | Mcallan, Cullum, et al., 1951 | Uncertainty assigned by TRC = 0.5 K |
Tfus | 324. | K | N/A | Harmon, 1945 | Uncertainty assigned by TRC = 5. K |

References

Kaldor and Hammond, 1991
Kaldor, S.W.; Hammond, M.,
A Mild Osmium Tetraoxide-Catalyzed Method for the Oxidation of Sulfides to Sulfones,
Tetrahedron Lett., 1991, 32, 5043-6. [all data]
Michalski, Wieczorkowski, et al., 1958
Michalski, J.; Wieczorkowski, J.; Modro, T.,
Reactions of Alkyl Alkanethioculfonates with Trialkyl Phosphites. A New Synthesis of O,O,S-Trialkyl Thiophosphates and Esters of Alkanesulfinic Acids,
Roczniki Chem., 1958, 32, 1409-11. [all data]
Idson and Spoerri, 1954
Idson, B.; Spoerri, P.E.,
1,4-Thiazans I. C-Alkyl Thiomorpholines,
J. Am. Chem. Soc., 1954, 76, 2902-6. [all data]
Mcallan, Cullum, et al., 1951
Mcallan, D.T.; Cullum, T.V.; Dean, R.A.; Fidler, F.A.,
The Preparation and Properties of Sulfur Compounds Related to Petroleum I. The Dialkyl Sulfides and Disulfides,
J. Am. Chem. Soc., 1951, 73, 3627-32. [all data]
Harmon, 1945
Harmon, J.,
, 1945. [all data]