(R)-(-)-2-Pentanol
- Formula: C5H12O
- Molecular weight: 88.1482
- IUPAC Standard InChIKey: JYVLIDXNZAXMDK-YFKPBYRVSA-N
- CAS Registry Number: 31087-44-2
- Chemical structure:
View 3d structure (requires JavaScript / HTML 5) - Stereoisomers:

Phase change data

Data compiled as indicated in comments:
BS - Robert L. Brown and Stephen E. Stein
TRC - Thermodynamics Research Center, NIST Boulder Laboratories, Chris Muzny director
Quantity | Value | Units | Method | Reference | Comment |
---|---|---|---|---|---|
Tboil | 392.7 | K | N/A | Aldrich Chemical Company Inc., 1990 | BS |
Tboil | 402. | K | N/A | Terry, Kepner, et al., 1960 | Uncertainty assigned by TRC = 0.3 K; TRC |

References

Aldrich Chemical Company Inc., 1990
Aldrich Chemical Company Inc.,
Catalog Handbook of Fine Chemicals, Aldrich Chemical Company, Inc., Milwaukee WI, 1990, 1. [all data]
Terry, Kepner, et al., 1960
Terry, T.D.; Kepner, R.E.; Dinsmore, W.,
Binary Systems Containing Isoamyl Alcohol or Active Amyl Alcohol,
J. Chem. Eng. Data, 1960, 5, 403. [all data]