Sulfur fluoride anion
- Formula: F4S-
- Molecular weight: 108.059
- CAS Registry Number: 31084-08-9

Reaction thermochemistry data

Data compiled by: John E. Bartmess
Individual Reactions
By formula: (F4S- • 4294967295F3S) + F3S = F4S-
Quantity | Value | Units | Method | Reference | Comment |
---|---|---|---|---|---|
ΔrH° | 177. ± 13. | kJ/mol | Ther | Miller, Miller, et al., 1995 | gas phase |
ΔrH° | 182. ± 32. | kJ/mol | Ther | Viggiano, MIller, et al., 1991 | gas phase; Between mCF3-nitrobenzene, C6F5NO2 |
ΔrH° | 264. ± 39. | kJ/mol | Ther | Babcock and Streit, 1981 | gas phase; EA: between NO2-, HS- |

Ion clustering data

Data compiled by: John E. Bartmess
Clustering reactions
By formula: (F4S- • 4294967295F3S) + F3S = F4S-
Quantity | Value | Units | Method | Reference | Comment |
---|---|---|---|---|---|
ΔrH° | 177. ± 13. | kJ/mol | Ther | Miller, Miller, et al., 1995 | gas phase |
ΔrH° | 182. ± 32. | kJ/mol | Ther | Viggiano, MIller, et al., 1991 | gas phase; Between mCF3-nitrobenzene, C6F5NO2 |
ΔrH° | 264. ± 39. | kJ/mol | Ther | Babcock and Streit, 1981 | gas phase; EA: between NO2-, HS- |

Gas phase thermochemistry data

Data compiled as indicated in comments:
B - John E. Bartmess

Quantity Value Units Method Reference Comment
Δfgas-216.2 ± 6.6kcal/molR-EAMiller, Miller, et al., 1995B
Δfgas-213.9 ± 2.3kcal/molEIAEThynne, 1972From SF6; B
Quantity Value Units Method Reference Comment
gas,1 bar74.775cal/mol*KReviewChase, 1998Data last reviewed in December, 1976

References

Miller, Miller, et al., 1995
Miller, A.E.S.; Miller, T.M.; Viggiano, A.A.; Morris, R.A.; Vandoren, J.M.; Arnold, S.T.; Paulson, J.,
Negative ion chemistry of SF4,
J. Chem. Phys., 1995, 102, 22, 8865, https://doi.org/10.1063/1.468940
. [all data]
Viggiano, MIller, et al., 1991
Viggiano, A.A.; MIller, T.M.; Miller, A.E.S.; Morris, R.A.; Van Doren, J.M.; Paulson, J.F.,
SF4: Electron Affinity Determination by Charge Transfer Reactions,
Int. J. Mass Spectrom. Ion Proc., 1991, 109, 327, https://doi.org/10.1016/0168-1176(91)85112-Y
. [all data]
Babcock and Streit, 1981
Babcock, L.M.; Streit, G.E.,
Negative ion-molecule reactions of SF4,
J. Chem. Phys., 1981, 75, 3864. [all data]