allo-L-isoleucine
- Formula: C6H13NO2
- Molecular weight: 131.1729
- IUPAC Standard InChIKey: AGPKZVBTJJNPAG-UHFFFAOYSA-N
- CAS Registry Number: 3107-04-8
- Chemical structure:
View 3d structure (requires JavaScript / HTML 5) - Species with the same structure:
- Stereoisomers:
- Other names: 2-Amino-3-methylpentanoic acid

Phase change data

Data compiled by: William E. Acree, Jr., James S. Chickos
Enthalpy of sublimation
ΔsubH (kJ/mol) | Temperature (K) | Method | Reference | Comment |
---|---|---|---|---|
120.1 ± 0.8 | 455. | ME | Svec and Clyde, 1965 | See also Clyde and Svec, 1964. |

References

Svec and Clyde, 1965
Svec, H.J.; Clyde, D.D.,
Vapor Pressures of Some α-Amino Acids.,
J. Chem. Eng. Data, 1965, 10, 2, 151-152, https://doi.org/10.1021/je60025a024
. [all data]
Clyde and Svec, 1964
Clyde, D.D.; Svec, H.,
, U. S. Atomic Energy Comm. IS-790, 1964, 1. [all data]