2,4,6-Trimethyl-1,3-phenylenediamine

Van Den Dool and Kratz RI, non-polar column, temperature ramp

Data compiled by: NIST Mass Spectrometry Data Center, William E. Wallace, director

Column type Capillary
Active phase SE-54
Column length (m) 25.
Carrier gas H2
Substrate
Column diameter (mm) 0.31
Phase thickness (μm)
Tstart (C) 35.
Tend (C) 250.
Heat rate (K/min) 4.
Initial hold (min) 3.
Final hold (min)
I 1318.
ReferenceLi, Wang, et al., 1998
Comment MSDC-RI

References

Li, Wang, et al., 1998
Li, W.; Wang, H.; Sun, Y.; Huang, A.; Sun, Y., Capillary gas chromatographic analysis of volatile components in goat feces, Fenxi Huaxue, 1998, 26, 8, 935-939. [all data]