exo-Norborneol, trifluoroacetate
- Formula: C9H11F3O2
- Molecular weight: 208.1776
- IUPAC Standard InChIKey: TYDZLCYUJXYSAI-UHFFFAOYSA-N
- CAS Registry Number: 31024-13-2
- Chemical structure:
View 3d structure (requires JavaScript / HTML 5) - Other names: Acetic acid, trifluoro-, 2-norbornyl ester, exo-

Reaction thermochemistry data

Data compiled by: Hussein Y. Afeefy, Joel F. Liebman, and Stephen E. Stein
Individual Reactions
By formula: C7H10 + C2HF3O2 = C9H11F3O2
Quantity | Value | Units | Method | Reference | Comment |
---|---|---|---|---|---|
ΔrH° | -64.15 ± 0.23 | kJ/mol | Cac | Wiberg, Wasserman, et al., 1985 | liquid phase; solvent: Trifluoroacetic acid; Trifluoroacetolysis |
By formula: C4F6O3 + C7H12O = C9H11F3O2 + C2HF3O2
Quantity | Value | Units | Method | Reference | Comment |
---|---|---|---|---|---|
ΔrH° | -91.09 ± 0.14 | kJ/mol | Cac | Wiberg, Wasserman, et al., 1985 | liquid phase; Trifluoroacetolysis |

References

Wiberg, Wasserman, et al., 1985
Wiberg, K.B.; Wasserman, D.J.; Martin, E.J.; Murcko, M.A.,
Enthalpies of hydration of alkenes. 3. Cycloalkenes,
J. Am. Chem. Soc., 1985, 107, 6019-6022. [all data]