NbC6

Gas phase ion energetics data

Data compiled by: John E. Bartmess

Electron affinity determinations

EA (eV) Method Reference Comment
3.040 ± 0.080LPESZhai, Liu, et al., 2001Vertical Detachment Energy: 3.23±0.08 eV

References

Zhai, Liu, et al., 2001
Zhai, H.-J.; Liu, S.-R.; Li, X.; Wang, L.-S., Photoelectron Spectroscopy of mono-Niobium Carbide Clusters NbCn-(n=2-7): Evidence for a Cyclic to Linear Structural Transition, J. Chem. Phys., 2001, 115, 11, 5170, https://doi.org/10.1063/1.1395556 . [all data]