4-Androsten-3,17-dione dimethoxime

Kovats' RI, non-polar column, isothermal

View large format table.

Column type Active phase Temperature (C) I Reference Comment
PackedOV-1230.2615.Baillie, Brooks, et al., 1972N2, Gas Chrom Q (100-120 mesh); Column length: 2. m

Normal alkane RI, non-polar column, isothermal

View large format table.

Column type Active phase Temperature (C) I Reference Comment
PackedOV-1180. - 200.2600.Horning, Moss, et al., 1968N2, Gas Chrom P; Column length: 3.7 m

References

Baillie, Brooks, et al., 1972
Baillie, T.A.; Brooks, C.J.W.; Middleditch, B.S., Comparison of Corticosteroid Derivatives by Gas-Chromatography-Mass Spectrometry, Anal. Chem., 1972, 44, 1, 30-37, https://doi.org/10.1021/ac60309a016 . [all data]

Horning, Moss, et al., 1968
Horning, M.G.; Moss, A.M.; Horning, E.C., Formation and gas-liquid chromatographic behavior of isomeric steroid ketone methoxime derivatives, Anal. Biochem., 1968, 22, 2, 284-294, https://doi.org/10.1016/0003-2697(68)90318-7 . [all data]