1,1-dichloro-2,2,2-trifluoro-1-phenylethane
- Formula: C8H5Cl2F3
- Molecular weight: 229.027
- IUPAC Standard InChIKey: VCGJIIDFWDVVQE-UHFFFAOYSA-N
- CAS Registry Number: 309-10-4
- Chemical structure:
View 3d structure (requires JavaScript / HTML 5) - Other names: 1,1,1-Trifluoro-2,2-dichloro-2-phenylethane

Phase change data

Data compiled as indicated in comments:
TRC - Thermodynamics Research Center, NIST Boulder Laboratories, Chris Muzny director
AC - William E. Acree, Jr., James S. Chickos
Quantity | Value | Units | Method | Reference | Comment |
---|---|---|---|---|---|
Tboil | 363. | K | N/A | Simons and Ramler, 1943 | Uncertainty assigned by TRC = 4. K; TRC |
Enthalpy of vaporization
ΔvapH (kJ/mol) | Temperature (K) | Method | Reference | Comment |
---|---|---|---|---|
47.2 | 380. | A | Stephenson and Malanowski, 1987 | Based on data from 365. to 446. K. See also Dykyj, Svoboda, et al., 1999.; AC |

References

Simons and Ramler, 1943
Simons, J.H.; Ramler, E.O.,
Preparation and Properties of SOme New Trifluoromethyl Compounds,
J. Am. Chem. Soc., 1943, 65, 389. [all data]
Stephenson and Malanowski, 1987
Stephenson, Richard M.; Malanowski, Stanislaw,
Handbook of the Thermodynamics of Organic Compounds, 1987, https://doi.org/10.1007/978-94-009-3173-2
. [all data]
Dykyj, Svoboda, et al., 1999
Dykyj, J.; Svoboda, J.; Wilhoit, R.C.; Frenkel, M.L.; Hall, K.R.,
Vapor Pressure of Chemicals: Part A. Vapor Pressure and Antoine Constants for Hydrocarbons and Sulfur, Selenium, Tellurium and Hydrogen Containing Organic Compounds, Springer, Berlin, 1999, 373. [all data]