Aldrin
- Formula: C12H8Cl6
- Molecular weight: 364.910
- IUPAC Standard InChIKey: QBYJBZPUGVGKQQ-SJJAEHHWSA-N
- CAS Registry Number: 309-00-2
- Chemical structure:
View 3d structure (requires JavaScript / HTML 5) - Stereoisomers:
- Other names: 1,4:5,8-Dimethanonaphthalene, 1,2,3,4,10,10-hexachloro-1,4,4a,5,8,8a-hexahydro-, (1α,4α,4aβ,5α,8α,8aβ)-; 1,2,3,4,10,10-Hexachloro-1,4,4a,5,8,8a-Hexahydro-1,4-endo-exo-5,8-dimethanonaphthalene; Kortofin; Aldrin-R; 1,4:5,8-Dimethanonaphthalene, 1,2,3,4,10,10-hexachloro-1,4,4a,5,8,8a-hexahydro-, endo,exo-; Aldocit; Compound 118; ENT 15,949; HHDN; Octalene; Seedrin; SD 2794; Tatuzinho; Tipula; (1R,4S,4aS,5S,8R,8aR)-1,2,3,4,10,10-hexachloro-1,4,4a,5,8,8a-hexahydro-1,4:5,8-dimethanonaphthalene; Aldrex; Aldrite; Aldrosol; Drinox; Hexachlorohexahydro-endo, exo-dimethanonaphthalene; NCI-C00044; 1,2,3,4,10,10-Hexachloro-1,4,4a,5,8,8a-hexahydro-endo-exo-1,4:5,8-dimethanonaphthalene; 1,2,3,4,10,10-Hexachloro-1,4,4a,5,8,8a-hexahydro-endo-1,4-exo-5,8-dimethanonaphthalene; 1,2,3,4,10,10-Hexachloro-1,4,4a,5,8,8a-hexahydro-exo-1,4-endo-5,8-dimethanonaphthalene; 1,2,3,4,10,10-Hexachloro-1,4,4a,5,8,8a-hexahydro-1,4:5,8-dimethanonaphthalene, endo,exo-; Aldrex 40; 1,2,3,4,10,10-Hexachloro-1α,4α,4aβ,5α,8α,8aβ-hexahydro1,4:5,8-dimethanonaphthalene; Aldrin Dust; Aldron; Algran; HHPN; OMS-194; Aldrine; 1,2,3,4,10,10-Hexachloro-1,4,4a,5,8,8a-hexahydro-endo-exo-1,4:5,8-dimethylnaphthalene (aldrin)

Phase change data

Data compiled as indicated in comments:
TRC - Thermodynamics Research Center, NIST Boulder Laboratories, Chris Muzny director
AC - William E. Acree, Jr., James S. Chickos
Quantity | Value | Units | Method | Reference | Comment |
---|---|---|---|---|---|
Tfus | 372. | K | N/A | Plato, 1972 | Crystal phase 1 phase; Uncertainty assigned by TRC = 1. K; TRC |
Tfus | 377.0 | K | N/A | Plato and Glasgow, 1969 | Uncertainty assigned by TRC = 0.2 K; TRC |
Enthalpy of vaporization
ΔvapH (kJ/mol) | Temperature (K) | Method | Reference | Comment |
---|---|---|---|---|
75.1 | 398. | GC | Hinckley, Bidleman, et al., 1990 | Based on data from 343. to 453. K.; AC |
Enthalpy of sublimation
ΔsubH (kJ/mol) | Temperature (K) | Method | Reference | Comment |
---|---|---|---|---|
91.8 | 326. | GS | Grayson and Fosbraey, 2006 | Based on data from 309. to 343. K.; AC |
Enthalpy of fusion
ΔfusH (kJ/mol) | Temperature (K) | Method | Reference | Comment |
---|---|---|---|---|
4.15 | 562.4 | DSC | Ksia«807»azczak and Nagata, 1995 | AC |

Henry's Law data

Data compiled by: Rolf Sander
Henry's Law constant (water solution)
kH(T) = k°H exp(d(ln(kH))/d(1/T) ((1/T) - 1/(298.15 K)))
k°H = Henry's law constant for solubility in water at 298.15 K (mol/(kg*bar))
d(ln(kH))/d(1/T) = Temperature dependence constant (K)
k°H (mol/(kg*bar)) | d(ln(kH))/d(1/T) (K) | Method | Reference | Comment |
---|---|---|---|---|
84. | Q | N/A | Value at T = 288. K. | |
36. | L | N/A |

Normal alkane RI, polar column, custom temperature program

Data compiled by: NIST Mass Spectrometry Data Center, William E. Wallace, director

Column type CapillaryCapillaryCapillaryCapillary
Active phase Carbowax 20MSuperox 0.6; Carbowax 20MSuperox 0.6; Carbowax 20MCarbowax 400, Carbowax 20M, Carbowax 1540, Carbowax 4000, Superox 06, PEG 20M, etc.
Column length (m)  50.50.50.
Carrier gas  HydrogenHydrogenHydrogen
Substrate
Column diameter (mm)  0.320.320.32
Phase thickness (μm)
Program not specifiednot specifiednot specifiednot specified
I 2502.2536.2537.2536.
ReferenceTameo and Kiyos, 1991Waggott and Davies, 1984Waggott and Davies, 1984Waggott and Davies, 1984
Comment MSDC-RI MSDC-RI MSDC-RI MSDC-RI

References

Plato, 1972
Plato, C.,
DSC as a general method for determining purity and heat of fusion of high-purity organic chemicals,
Anal. Chem., 1972, 44, 1531. [all data]
Plato and Glasgow, 1969
Plato, C.; Glasgow, A.R., Jr.,
Differential scanning calorimetry as a general method for determining the purity and heat of fusion of high-purity organic chemicals. Application to 95 compounds,
Anal. Chem., 1969, 41, 2, 330, https://doi.org/10.1021/ac60271a041
. [all data]
Hinckley, Bidleman, et al., 1990
Hinckley, Daniel A.; Bidleman, Terry F.; Foreman, William T.; Tuschall, Jack R.,
Determination of vapor pressures for nonpolar and semipolar organic compounds from gas chromatograhic retention data,
J. Chem. Eng. Data, 1990, 35, 3, 232-237, https://doi.org/10.1021/je00061a003
. [all data]
Grayson and Fosbraey, 2006
Grayson, B. Terence; Fosbraey, Lynda A.,
Determination of the vapour pressure of pesticides,
Pestic. Sci., 2006, 13, 3, 269-278, https://doi.org/10.1002/ps.2780130308
. [all data]
Ksia«807»azczak and Nagata, 1995
Ksia«807»azczak, A.; Nagata, I.,
Crystal-plastic and plastic-liquid phase transitions, and purity determination,
Thermochimica Acta, 1995, 254, 31-39, https://doi.org/10.1016/0040-6031(94)02032-J
. [all data]