Benzenamine, N,N-bis(2-hydroxy-3-phenoxypropyl)-
- Formula: C24H27NO4
- Molecular weight: 393.4755
- IUPAC Standard InChIKey: PGJOBAKEAXXLSG-UHFFFAOYSA-N
- CAS Registry Number: 3088-05-9
- Chemical structure:

Gas phase thermochemistry data

Data compiled by: Hussein Y. Afeefy, Joel F. Liebman, and Stephen E. Stein
Quantity | Value | Units | Method | Reference | Comment |
---|---|---|---|---|---|
ΔfH°gas | -104.4 ± 1.0 | kcal/mol | Ccb | Kuznetsova, Miroshnichenko, et al., 1976 |

References

Kuznetsova, Miroshnichenko, et al., 1976
Kuznetsova, V.P.; Miroshnichenko, E.A.; Zelenetskii, A.N.; Rakova, G.V.; Lebedev, Yu.A.; Enikolopyan, N.S.,
Enthalpies of reactions of epoxides with primary amines,
Dokl. Phys. Chem. (Engl. Transl.), 1976, 226, 147-150, In original 1109. [all data]