titanium(4+) ethanolate
- Formula: C8H20O4Ti
- Molecular weight: 228.109
- IUPAC Standard InChIKey: JMXKSZRRTHPKDL-UHFFFAOYSA-N
- CAS Registry Number: 3087-36-3
- Chemical structure:
View 3d structure (requires JavaScript / HTML 5) - Other names: Ti(OEt)4

Gas phase thermochemistry data

Data compiled by: José A. Martinho Simões
Quantity | Value | Units | Method | Reference | Comment |
---|---|---|---|---|---|
ΔfH°gas | -1374.8 ± 9.9 | kJ/mol | Review | Martinho Simões | |
ΔfH°gas | -1363.5 ± 9.0 | kJ/mol | Review | Martinho Simões | |
ΔfH°gas | -1358.1 ± 9.9 | kJ/mol | Review | Martinho Simões | |
ΔfH°gas | -1360.8 ± 9.0 | kJ/mol | Review | Martinho Simões | Selected data. Average of the RSC results Bradley and Hillyer, 1966 |

Condensed phase thermochemistry data

Data compiled by: José A. Martinho Simões
Quantity | Value | Units | Method | Reference | Comment |
---|---|---|---|---|---|
ΔfH°liquid | -1475.2 ± 5.2 | kJ/mol | Review | Martinho Simões | |
ΔfH°liquid | -1463.9 ± 3.3 | kJ/mol | Review | Martinho Simões | |
ΔfH°liquid | -1458.5 ± 5.3 | kJ/mol | Review | Martinho Simões | |
ΔfH°liquid | -1461.2 ± 3.1 | kJ/mol | Review | Martinho Simões | Selected data. Average of the RSC results Bradley and Hillyer, 1966 |
Quantity | Value | Units | Method | Reference | Comment |
ΔcH°liquid | -5475.2 ± 5.0 | kJ/mol | CC-SB | Shaulov, Genchel, et al., 1972 | Please also see Pedley and Rylance, 1977 and Tel'noi and Rabinovich, 1977. |

Phase change data

Data compiled by: José A. Martinho Simões
Quantity | Value | Units | Method | Reference | Comment |
---|---|---|---|---|---|
ΔvapH° | 100.4 ± 8.4 | kJ/mol | CC-SB | Bradley and Hillyer, 1966 | Please also see Pedley and Rylance, 1977. |

Reaction thermochemistry data

Data compiled by: José A. Martinho Simões
Individual Reactions
4 (l) +
(l) =
(l) + 4(
• 51.3
) (solution)
By formula: 4C2H6O (l) + Cl4Ti (l) = C8H20O4Ti (l) + 4(HCl • 51.3H2O) (solution)
Quantity | Value | Units | Method | Reference | Comment |
---|---|---|---|---|---|
ΔrH° | -49.1 ± 1.0 | kcal/mol | RSC | Bradley and Hillyer, 1966 | Please also see Pedley and Rylance, 1977. |
By formula: 4C2H6O (l) + Cl4Ti (l) = C8H20O4Ti (l) + 4HCl (g)
Quantity | Value | Units | Method | Reference | Comment |
---|---|---|---|---|---|
ΔrH° | 19.5 ± 0.1 | kcal/mol | RSC | Bradley and Hillyer, 1966 | Please also see Pedley and Rylance, 1977. |

References

Martinho Simões
Martinho Simões, J.A.,
Private communication (see http://webbook.nist.gov/chemistry/om/). [all data]
Bradley and Hillyer, 1966
Bradley, D.C.; Hillyer, M.J.,
Trans. Faraday Soc., 1966, 62, 2367. [all data]
Shaulov, Genchel, et al., 1972
Shaulov, Yu.Kh.; Genchel, V.G.; Aizatullova, R.M.; Petrova, N.V.,
Zh. Fiz. Khim., 1972, 46, 2382. [all data]
Pedley and Rylance, 1977
Pedley, J.B.; Rylance, J.,
Computer Analysed Thermochemical Data: Organic and Organometallic Compounds, University of Sussex, Brigton, 1977. [all data]
Tel'noi and Rabinovich, 1977
Tel'noi, V.I.; Rabinovich, I.B.,
Russ. Chem. Rev., 1977, 46, 689. [all data]