1-Butyl-3-phenylurea
- Formula: C11H16NO2
- Molecular weight: 194.2502
- IUPAC Standard InChIKey: DOUCJWNVCGEZRR-UHFFFAOYSA-N
- CAS Registry Number: 3083-88-3
- Chemical structure:
View 3d structure (requires JavaScript / HTML 5) - Other names: Urea, N-butyl-N'-phenyl-

Reaction thermochemistry data

Data compiled by: Hussein Y. Afeefy, Joel F. Liebman, and Stephen E. Stein
Individual Reactions
By formula: C7H5NO + C4H11N = C11H16NO2
Quantity | Value | Units | Method | Reference | Comment |
---|---|---|---|---|---|
ΔrH° | -112. | kJ/mol | Cm | Pannone and Macosko, 1987 | liquid phase |

References

Pannone and Macosko, 1987
Pannone, M.C.; Macosko, C.W.,
Kinetics of isocyanate amine reactions,
J. Appl. Polym. Sci., 1987, 34, 2409-2432. [all data]