trans-β-Elemenone
- Formula: C15H22O
- Molecular weight: 218.3346
- IUPAC Standard InChIKey: ABLPGPHZENVRRH-HIFRSBDPSA-N
- CAS Registry Number: 30824-86-3
- Chemical structure:
View 3d structure (requires JavaScript / HTML 5) - Species with the same structure:
- Stereoisomers:

Normal alkane RI, non-polar column, temperature ramp

Column type | Active phase | I | Reference | Comment |
---|---|---|---|---|
Capillary | DB-5 | 1597. | Rodriques, Amorim, et al., 2013 | 30. m/0.25 mm/0.25 μm, Helium, 3. K/min; Tstart: 60. C; Tend: 240. C |
Capillary | HP-5 | 1596. | Stashenko, Jaramillo, et al., 2003 | 60. m/0.25 mm/0.25 μm, 40. C @ 15. min, 5. K/min; Tend: 250. C |

Normal alkane RI, non-polar column, custom temperature program

Column type | Active phase | I | Reference | Comment |
---|---|---|---|---|
Capillary | DB-5 | 1601. | Rodriques, Amorim, et al., 2013 | 30. m/0.25 mm/0.25 μm, Helium; Program: not specified |

Normal alkane RI, polar column, temperature ramp

Column type | Active phase | I | Reference | Comment |
---|---|---|---|---|
Capillary | HP-Innowax | 2008. | Stashenko, Jaramillo, et al., 2003 | 50. m/0.2 mm/0.2 μm, 50. C @ 5. min, 4. K/min; Tend: 220. C |

References

Rodriques, Amorim, et al., 2013
Rodriques, K.A. da.F.; Amorim, L.V.; de Oliveira, J.M.G.; Dias, C.N.; Moraes, D.F.C.; Andrade, E.H. deA.; Maia, J.G.S.; Carneiro, S.M.P.; Carvalho, F.A. deA.,
Eugenia uniflora L. essential oil as a potential anti-Leishmania agent: effect on Leishmania amazonensis and possible mechanism of action,
Evidence-Based Complementary and Alternative Medicine, 2013, 2013, 1-10, https://doi.org/10.1155/2013/279726
. [all data]
Stashenko, Jaramillo, et al., 2003
Stashenko, E.E.; Jaramillo, B.E.; Martínez, J.R.,
Comparación de la composición química y de la actividad antioxidante in vitro de los metabolitos secundarios volátiles de plantas de la familia verbenaceae,
Rev. Acad. Colomb. Cienc. Exactas Fis. Nat., 2003, 27, 105, 579-597. [all data]