1,1'-Biphenyl, 2,2',5,5'-tetramethyl-
- Formula: C16H18
- Molecular weight: 210.3141
- IUPAC Standard InChIKey: ZHTROMYSDSTCCE-UHFFFAOYSA-N
- CAS Registry Number: 3075-84-1
- Chemical structure:
View 3d structure (requires JavaScript / HTML 5) - Other names: Biphenyl-, 2,2',5,5'-tetramethyl-; 2,2',5,5'-Tetramethyl-1,1'-biphenyl

Phase change data

Data compiled as indicated in comments:
BS - Robert L. Brown and Stephen E. Stein
TRC - Thermodynamics Research Center, NIST Boulder Laboratories, Chris Muzny director
Quantity | Value | Units | Method | Reference | Comment |
---|---|---|---|---|---|
Tfus | 326. | K | N/A | Longo and Pirona, 1947 | Uncertainty assigned by TRC = 4. K; TRC |
Tfus | 323. | K | N/A | Ullmann, 1904 | Uncertainty assigned by TRC = 4. K; TRC |
Reduced pressure boiling point
Tboil (K) | Pressure (bar) | Reference | Comment |
---|---|---|---|
557.2 | 0.976 | Weast and Grasselli, 1989 | BS |

References

Longo and Pirona, 1947
Longo; Pirona,
Gazz. Chim. Ital., 1947, 77, 127. [all data]
Ullmann, 1904
Ullmann, F.,
Justus Liebigs Ann. Chem., 1904, 332, 38. [all data]
Weast and Grasselli, 1989
CRC Handbook of Data on Organic Compounds, 2nd Editon, Weast,R.C and Grasselli, J.G., ed(s)., CRC Press, Inc., Boca Raton, FL, 1989, 1. [all data]